program: Orca
programVersion: 5.0.2
elementType: S S S S P P O O O O C C C C C C C C C H H H H H H H H H H H H H H H H H H H H H H
charge: 0
multiplicity: 1
keywords: wb97x-d3
keywords: def2-TZVPP
keywords: def2/J RIJCOSX
keywords: DEFGRID2
keywords: scfconv7
keywords: smallprint printgap noloewdin
keywords: NOSOSCF
formula: C9H22O4P2S4
InChI: InChI=1/C9H22O4P2S4/c1-5-10-14(16,11-6-2)18-9-19-15(17,12-7-3)13-8-4/h5-9H2,1-4H3
41 atoms
S  -0.947183 1.233395 1.004018
S  0.896353 -1.226745 1.083032
S  -3.10208 -1.410695 0.90801
S  2.910318 1.504575 1.319138
P  -2.289272 0.039629 -0.064217
P  2.30495 0.048487 0.211306
O  -3.274552 1.153784 -0.657137
O  -1.433314 -0.344089 -1.352707
O  3.400109 -1.01947 -0.261063
O  1.640586 0.42898 -1.186178
C  -0.105562 -0.025715 1.99744
C  -4.539079 1.494176 -0.051788
C  -1.811399 -1.429702 -2.231214
C  4.308559 -1.631655 0.680212
C  1.923208 1.651478 -1.905098
C  -4.383852 2.351985 1.177235
C  -0.872192 -2.592883 -2.050551
C  5.555346 -2.043174 -0.055196
C  0.707633 2.035453 -2.705929
H  0.519068 0.52145 2.703071
H  -0.834742 -0.606416 2.561814
H  -5.081739 2.025781 -0.831721
H  -5.086464 0.577852 0.175247
H  -2.845344 -1.729251 -2.050513
H  -1.755413 -1.025135 -3.241367
H  4.546447 -0.924401 1.478229
H  3.812703 -2.494509 1.128888
H  2.184969 2.440624 -1.198937
H  2.784223 1.472391 -2.550132
H  -5.37306 2.667467 1.510247
H  -3.915487 1.811374 1.999602
H  -3.800179 3.248935 0.970879
H  -1.119233 -3.369412 -2.774793
H  0.163687 -2.295691 -2.214171
H  -0.956782 -3.020097 -1.052111
H  6.074102 -1.181999 -0.47502
H  6.231865 -2.532974 0.644879
H  5.337219 -2.748164 -0.856985
H  0.942831 2.928271 -3.285836
H  0.414135 1.253126 -3.405595
H  -0.138985 2.269548 -2.061666
elementType: S P O C H
totalener: -2932.91285104 hartree
nucrepener: 2765.36697237 hartree
electener: -5698.27982341 hartree
oneelecener: -9554.58509408 hartree
twoeener: 3856.30527066 hartree
cpcmener: -0.02437902 hartree
kineticenergy: 2925.77700556 hartree
xcener: -173.633105046868 hartree
chargesum: 0.0000000
charge: -0.139698 -0.143419 -0.450008 -0.450739 0.654802 0.661351 -0.368650 -0.337334 -0.362924 -0.336070 -0.108216 0.040009 0.042054 0.034854 0.031638 -0.247291 -0.243987 -0.240643 -0.255108 0.165683 0.164211 0.110059 0.093747 0.093614 0.109049 0.093681 0.102370 0.097931 0.116703 0.102730 0.076740 0.091363 0.105813 0.082006 0.074844 0.086456 0.089263 0.089571 0.104712 0.092366 0.076466
qa: -0.1397 -0.1434 -0.4500 -0.4507 0.6548 0.6614 -0.3687 -0.3373 -0.3629 -0.3361 -0.1082 0.0400 0.0421 0.0349 0.0316 -0.2473 -0.2440 -0.2406 -0.2551 0.1657 0.1642 0.1101 0.0937 0.0936 0.1090 0.0937 0.1024 0.0979 0.1167 0.1027 0.0767 0.0914 0.1058 0.0820 0.0748 0.0865 0.0893 0.0896 0.1047 0.0924 0.0765
va: 2.3010 2.3008 1.9956 2.0026 5.3946 5.4107 2.0880 2.0886 2.1033 2.0940 3.9039 3.8580 3.8284 3.8488 3.8179 3.8933 3.9276 3.9632 3.9417 1.0164 1.0195 0.9907 1.0125 1.0141 0.9948 1.0047 0.9941 1.0121 0.9933 1.0109 1.0170 1.0036 1.0119 1.0118 1.0122 1.0070 1.0060 1.0036 1.0105 1.0021 1.0138
dispcorr: -0.023386177 hartree
energy: -2932.936237219848
dipole: 1.50458 -1.69728 -0.19269 -1.06149 0.97651 -0.08498 -12.96801 11.99153 -0.97648
magnitude: 0.99893 au
magnitude: 2.53909 debye
