program: Orca
programVersion: 5.0.2
elementType: S S S S P P O O O O C C C C C C C C C H H H H H H H H H H H H H H H H H H H H H H
charge: 0
multiplicity: 1
keywords: wb97x-d3
keywords: def2-TZVPP
keywords: def2/J RIJCOSX
keywords: DEFGRID2
keywords: scfconv7
keywords: smallprint printgap noloewdin
keywords: NOSOSCF
formula: C9H22O4P2S4
InChI: InChI=1/C9H22O4P2S4/c1-5-10-14(16,11-6-2)18-9-19-15(17,12-7-3)13-8-4/h5-9H2,1-4H3
41 atoms
S  -0.452378 -0.983794 -1.331123
S  0.983128 -0.062094 1.213684
S  -2.614025 -1.666773 1.199106
S  3.381669 2.152351 1.456947
P  -2.231696 -0.550104 -0.323389
P  2.75414 0.678159 0.393752
O  -2.11684 1.01601 -0.046243
O  -3.268093 -0.567356 -1.539772
O  3.722033 -0.582736 0.21924
O  2.476544 0.918661 -1.159449
C  0.596956 -1.426897 0.076475
C  -2.831839 1.666751 1.026672
C  -3.715292 -1.81273 -2.123233
C  4.612382 -1.029082 1.262449
C  2.164079 2.21719 -1.706276
C  -4.306711 1.79216 0.738432
C  -5.119441 -2.131225 -1.681887
C  3.901221 -1.673595 2.42661
C  0.757106 2.668345 -1.405118
H  0.097337 -2.192889 0.668284
H  1.503161 -1.871994 -0.332394
H  -2.654359 1.124829 1.95674
H  -2.362946 2.645286 1.111749
H  -3.662154 -1.671181 -3.201255
H  -3.032232 -2.624536 -1.864893
H  5.26821 -1.743582 0.768715
H  5.222225 -0.186824 1.594405
H  2.894089 2.942815 -1.344337
H  2.311445 2.102091 -2.778504
H  -4.488164 2.308024 -0.203859
H  -4.803751 0.822176 0.708198
H  -4.771638 2.374578 1.533809
H  -5.455111 -3.038239 -2.184854
H  -5.168242 -2.301866 -0.607465
H  -5.809692 -1.330062 -1.941606
H  3.237264 -2.4747 2.101962
H  4.651376 -2.107534 3.088104
H  3.324386 -0.956678 3.008689
H  0.581952 3.614935 -1.917376
H  0.022191 1.950091 -1.76225
H  0.597337 2.835026 -0.339922
elementType: S P O C H
totalener: -2932.91254619 hartree
nucrepener: 2717.63740525 hartree
electener: -5650.54995144 hartree
oneelecener: -9458.35981691 hartree
twoeener: 3807.80986548 hartree
cpcmener: -0.02470336 hartree
kineticenergy: 2925.78754118 hartree
xcener: -173.638104228437 hartree
chargesum: -0.0000000
charge: -0.136623 -0.135228 -0.445146 -0.445622 0.639268 0.636161 -0.339153 -0.362310 -0.350521 -0.349174 -0.118204 0.043580 0.047301 0.034057 0.041621 -0.237053 -0.243496 -0.252846 -0.251964 0.169476 0.159096 0.093086 0.108390 0.112614 0.086661 0.112893 0.097170 0.096032 0.113211 0.091714 0.075708 0.099476 0.098393 0.076039 0.091100 0.093283 0.106560 0.079543 0.107075 0.081823 0.076008
qa: -0.1366 -0.1352 -0.4451 -0.4456 0.6393 0.6362 -0.3392 -0.3623 -0.3505 -0.3492 -0.1182 0.0436 0.0473 0.0341 0.0416 -0.2371 -0.2435 -0.2528 -0.2520 0.1695 0.1591 0.0931 0.1084 0.1126 0.0867 0.1129 0.0972 0.0960 0.1132 0.0917 0.0757 0.0995 0.0984 0.0760 0.0911 0.0933 0.1066 0.0795 0.1071 0.0818 0.0760
va: 2.3155 2.2962 1.9960 2.0157 5.4128 5.4364 2.0925 2.0846 2.0918 2.0940 3.9124 3.8355 3.8452 3.8431 3.8328 3.9221 3.9395 3.8962 3.8984 1.0215 1.0197 1.0130 0.9897 0.9932 1.0107 0.9916 1.0111 1.0136 0.9914 1.0061 1.0156 1.0087 1.0086 1.0164 1.0028 1.0035 1.0108 1.0145 1.0132 1.0216 1.0150
dispcorr: -0.023256958 hartree
energy: -2932.935803144167
dipole: -12.74931 12.17490 -0.57441 0.02030 -0.84715 -0.82685 -3.19227 1.98793 -1.20434
magnitude: 1.56973 au
magnitude: 3.98993 debye
