program: Orca
programVersion: 5.0.2
elementType: S S S S P P O O O O C C C C C C C C C H H H H H H H H H H H H H H H H H H H H H H
charge: 0
multiplicity: 1
keywords: wb97x-d3
keywords: def2-TZVPP
keywords: def2/J RIJCOSX
keywords: DEFGRID2
keywords: scfconv7
keywords: smallprint printgap noloewdin
keywords: NOSOSCF
formula: C9H22O4P2S4
InChI: InChI=1/C9H22O4P2S4/c1-5-10-14(16,11-6-2)18-9-19-15(17,12-7-3)13-8-4/h5-9H2,1-4H3
41 atoms
S  -0.418541 -1.805546 0.45396
S  0.830691 0.969423 0.80567
S  -3.008162 0.171125 1.442827
S  3.747813 -0.752619 1.130861
P  -2.226973 -0.84629 0.00634
P  2.716459 0.44949 0.040153
O  -1.894861 -0.04427 -1.330524
O  -3.058846 -2.078742 -0.578985
O  2.544294 -0.106461 -1.438606
O  3.299636 1.918624 -0.206299
C  0.313064 -0.58557 1.573312
C  -2.561438 1.184943 -1.691721
C  -3.704876 -3.029033 0.300354
C  1.49721 0.23558 -2.372886
C  3.851278 2.698539 0.879816
C  -3.966048 0.946209 -2.184103
C  -5.185722 -2.759926 0.374044
C  1.519859 1.673659 -2.824566
C  5.357195 2.683605 0.828126
H  -0.404576 -0.324393 2.35064
H  1.167867 -1.066944 2.050709
H  -2.549915 1.865393 -0.838745
H  -1.935353 1.613995 -2.472404
H  -3.501598 -4.010035 -0.126644
H  -3.251093 -3.001857 1.29385
H  1.669037 -0.431725 -3.215316
H  0.535252 -0.025768 -1.933701
H  3.459422 3.706067 0.747919
H  3.488815 2.326856 1.841097
H  -3.983075 0.257548 -3.028465
H  -4.613183 0.553922 -1.398785
H  -4.390029 1.894223 -2.515909
H  -5.394232 -1.790403 0.826049
H  -5.64669 -2.793048 -0.613479
H  -5.657095 -3.527281 0.989005
H  1.23806 2.369656 -2.0350
H  2.495888 1.959485 -3.215808
H  0.794086 1.785853 -3.63074
H  5.747724 3.331131 1.613733
H  5.75185 1.680913 0.991133
H  5.727555 3.056138 -0.126969
elementType: S P O C H
totalener: -2932.91250508 hartree
nucrepener: 2707.38222784 hartree
electener: -5640.29473292 hartree
oneelecener: -9437.46277874 hartree
twoeener: 3797.16804582 hartree
cpcmener: -0.02491035 hartree
kineticenergy: 2925.76970461 hartree
xcener: -173.632636925024 hartree
chargesum: 0.0000000
charge: -0.138714 -0.152181 -0.441512 -0.442445 0.640241 0.625667 -0.339290 -0.360887 -0.342820 -0.345666 -0.119548 0.048072 0.049986 0.058415 0.047123 -0.237875 -0.244954 -0.254162 -0.238110 0.167944 0.166070 0.095231 0.106931 0.112386 0.087251 0.114387 0.062486 0.111942 0.084962 0.092115 0.076915 0.099440 0.077193 0.091474 0.098775 0.077907 0.100915 0.103778 0.095188 0.074940 0.090426
qa: -0.1387 -0.1522 -0.4415 -0.4424 0.6402 0.6257 -0.3393 -0.3609 -0.3428 -0.3457 -0.1195 0.0481 0.0500 0.0584 0.0471 -0.2379 -0.2450 -0.2542 -0.2381 0.1679 0.1661 0.0952 0.1069 0.1124 0.0873 0.1144 0.0625 0.1119 0.0850 0.0921 0.0769 0.0994 0.0772 0.0915 0.0988 0.0779 0.1009 0.1038 0.0952 0.0749 0.0904
va: 2.3095 2.2991 1.9970 2.0225 5.4187 5.4485 2.0953 2.0849 2.1130 2.0699 3.8935 3.8264 3.8414 3.8491 3.8327 3.9316 3.9385 3.9080 3.9429 1.0226 1.0266 1.0127 0.9881 0.9937 1.0104 0.9946 1.0305 0.9935 1.0108 1.0059 1.0150 1.0080 1.0158 1.0028 1.0085 1.0119 1.0083 1.0057 1.0076 1.0184 1.0039
dispcorr: -0.022811613 hartree
energy: -2932.935316693536
dipole: -10.23298 8.70000 -1.53298 10.04919 -8.94665 1.10254 -11.56330 10.62045 -0.94286
magnitude: 2.11059 au
magnitude: 5.36470 debye
