program: Orca
programVersion: 5.0.2
elementType: S S S S P P O O O O C C C C C C C C C H H H H H H H H H H H H H H H H H H H H H H
charge: 0
multiplicity: 1
keywords: wb97x-d3
keywords: def2-TZVPP
keywords: def2/J RIJCOSX
keywords: DEFGRID2
keywords: scfconv7
keywords: smallprint printgap noloewdin
keywords: NOSOSCF
formula: C9H22O4P2S4
InChI: InChI=1/C9H22O4P2S4/c1-5-10-14(16,11-6-2)18-9-19-15(17,12-7-3)13-8-4/h5-9H2,1-4H3
41 atoms
S  -0.845955 1.315319 1.039837
S  0.888783 -1.216034 1.054206
S  -2.949375 -1.340181 1.139157
S  3.082761 1.390121 1.084902
P  -2.239859 0.092016 0.063328
P  2.357596 -0.085587 0.082364
O  -3.251057 1.203814 -0.480314
O  -1.527953 -0.305145 -1.306412
O  3.371686 -1.248999 -0.340863
O  1.680827 0.241598 -1.32089
C  0.042412 0.070379 2.007959
C  -4.203157 1.840708 0.402374
C  -1.51438 -1.646853 -1.837423
C  4.270197 -1.841318 0.624363
C  2.10615 1.340786 -2.160771
C  -5.574823 1.24004 0.23005
C  -2.777431 -1.952292 -2.601178
C  5.674426 -1.331986 0.425922
C  1.109073 2.467397 -2.093905
H  0.760363 0.613773 2.621656
H  -0.64898 -0.453787 2.667053
H  -3.871158 1.768625 1.4408
H  -4.195994 2.894481 0.128217
H  -0.640282 -1.681764 -2.485093
H  -1.359472 -2.361298 -1.028014
H  3.923862 -1.645851 1.641954
H  4.213121 -2.916659 0.460601
H  3.101663 1.680571 -1.871074
H  2.17434 0.9295 -3.166883
H  -5.912832 1.306829 -0.803885
H  -5.596566 0.195916 0.539915
H  -6.283406 1.790301 0.849496
H  -3.652447 -1.943221 -1.950635
H  -2.937129 -1.242699 -3.412733
H  -2.698555 -2.948376 -3.037723
H  6.031246 -1.528709 -0.585016
H  5.742412 -0.262195 0.620527
H  6.340784 -1.844195 1.120386
H  1.073917 2.91024 -1.099508
H  1.402386 3.242984 -2.801851
H  0.107549 2.129419 -2.359896
elementType: S P O C H
totalener: -2932.91213073 hartree
nucrepener: 2755.03428032 hartree
electener: -5687.94641105 hartree
oneelecener: -9533.77031526 hartree
twoeener: 3845.82390421 hartree
cpcmener: -0.02347175 hartree
kineticenergy: 2925.77968346 hartree
xcener: -173.634421054384 hartree
chargesum: 0.0000000
charge: -0.146030 -0.146126 -0.442226 -0.448941 0.657761 0.657613 -0.368150 -0.349637 -0.365474 -0.340378 -0.109434 0.044637 0.056766 0.046607 0.054630 -0.242380 -0.241119 -0.240116 -0.251339 0.165095 0.165710 0.086802 0.112478 0.106945 0.087706 0.084836 0.111916 0.089888 0.109617 0.091026 0.075236 0.096095 0.076134 0.091608 0.096361 0.090702 0.074009 0.095388 0.075873 0.106266 0.083642
qa: -0.1460 -0.1461 -0.4422 -0.4489 0.6578 0.6576 -0.3681 -0.3496 -0.3655 -0.3404 -0.1094 0.0446 0.0568 0.0466 0.0546 -0.2424 -0.2411 -0.2401 -0.2513 0.1651 0.1657 0.0868 0.1125 0.1069 0.0877 0.0848 0.1119 0.0899 0.1096 0.0910 0.0752 0.0961 0.0761 0.0916 0.0964 0.0907 0.0740 0.0954 0.0759 0.1063 0.0836
va: 2.3042 2.3063 1.9936 1.9873 5.4008 5.4146 2.0861 2.0775 2.0871 2.0937 3.8900 3.8505 3.8133 3.8458 3.8169 3.9401 3.9524 3.9460 3.9352 1.0192 1.0197 1.0096 0.9925 0.9934 1.0132 1.0105 0.9933 1.0147 0.9966 1.0032 1.0183 1.0077 1.0174 1.0057 1.0070 1.0034 1.0187 1.0075 1.0107 1.0119 1.0120
dispcorr: -0.022990836 hartree
energy: -2932.935121565624
dipole: -2.86542 3.01742 0.15200 0.28347 -0.40856 -0.12509 -12.78166 12.11336 -0.66830
magnitude: 0.69669 au
magnitude: 1.77084 debye
