program: Orca
programVersion: 5.0.2
elementType: S S S S P P O O O O C C C C C C C C C H H H H H H H H H H H H H H H H H H H H H H
charge: 0
multiplicity: 1
keywords: wb97x-d3
keywords: def2-TZVPP
keywords: def2/J RIJCOSX
keywords: DEFGRID2
keywords: scfconv7
keywords: smallprint printgap noloewdin
keywords: NOSOSCF
formula: C9H22O4P2S4
InChI: InChI=1/C9H22O4P2S4/c1-5-10-14(16,11-6-2)18-9-19-15(17,12-7-3)13-8-4/h5-9H2,1-4H3
41 atoms
S  -1.187953 1.063674 0.786846
S  0.923149 -1.156516 0.95252
S  -3.372417 -1.373064 1.737086
S  2.887528 1.618897 1.101133
P  -2.683109 -0.325038 0.280928
P  2.291075 0.130326 0.032621
O  -3.685919 0.640257 -0.504171
O  -2.098076 -1.249444 -0.875977
O  3.392872 -0.925189 -0.44693
O  1.592484 0.488578 -1.355105
C  -0.123036 0.035756 1.827275
C  -4.850853 1.244954 0.098101
C  -1.621217 -0.732967 -2.139531
C  4.383734 -1.461536 0.457663
C  1.919861 1.6826 -2.102116
C  -4.504692 2.418628 0.978297
C  -0.685052 -1.746357 -2.743639
C  5.616257 -1.802507 -0.336648
C  3.286858 1.609809 -2.734953
H  0.502417 0.7217 2.399514
H  -0.725931 -0.536412 2.533633
H  -5.46361 1.557685 -0.745344
H  -5.40287 0.484713 0.6529
H  -2.480693 -0.558025 -2.78743
H  -1.112244 0.220773 -1.986334
H  4.613142 -0.727515 1.233084
H  3.966334 -2.346781 0.940178
H  1.140119 1.749496 -2.858754
H  1.830264 2.550486 -1.446828
H  -3.955856 2.116118 1.869998
H  -3.918846 3.164876 0.44201
H  -5.430028 2.893487 1.305685
H  0.173481 -1.934577 -2.100475
H  -1.189555 -2.692731 -2.938091
H  -0.316298 -1.364078 -3.695464
H  6.052025 -0.914956 -0.794776
H  6.360399 -2.235134 0.331957
H  5.403524 -2.533011 -1.116848
H  4.084764 1.614452 -1.991773
H  3.393356 0.72279 -3.358885
H  3.425772 2.484786 -3.370496
elementType: S P O C H
totalener: -2932.91566918 hartree
nucrepener: 2719.41453555 hartree
electener: -5652.33020473 hartree
oneelecener: -9461.80663810 hartree
twoeener: 3809.47643337 hartree
cpcmener: -0.02534402 hartree
kineticenergy: 2925.75171927 hartree
xcener: -173.627260866915 hartree
chargesum: 0.0000000
charge: -0.146999 -0.140474 -0.437365 -0.442967 0.629948 0.635729 -0.344993 -0.334680 -0.356462 -0.334788 -0.111203 0.037008 0.011320 0.041833 0.041934 -0.245388 -0.242709 -0.241660 -0.236945 0.164923 0.160763 0.108777 0.094566 0.119119 0.095418 0.092608 0.102559 0.106118 0.097932 0.077066 0.092457 0.103654 0.070671 0.099287 0.095516 0.086990 0.090972 0.090403 0.077312 0.091807 0.099946
qa: -0.1470 -0.1405 -0.4374 -0.4430 0.6299 0.6357 -0.3450 -0.3347 -0.3565 -0.3348 -0.1112 0.0370 0.0113 0.0418 0.0419 -0.2454 -0.2427 -0.2417 -0.2369 0.1649 0.1608 0.1088 0.0946 0.1191 0.0954 0.0926 0.1026 0.1061 0.0979 0.0771 0.0925 0.1037 0.0707 0.0993 0.0955 0.0870 0.0910 0.0904 0.0773 0.0918 0.0999
va: 2.2937 2.3118 2.0265 2.0093 5.4439 5.4159 2.0911 2.1079 2.0898 2.0955 3.9038 3.8562 3.8413 3.8436 3.8237 3.8855 3.9345 3.9582 3.9191 1.0217 1.0246 0.9903 1.0107 0.9997 1.0002 1.0059 0.9939 0.9887 1.0137 1.0172 1.0030 1.0113 1.0223 1.0060 1.0059 1.0058 1.0068 1.0036 1.0183 1.0060 1.0082
dispcorr: -0.022944452 hartree
energy: -2932.938613634881
dipole: 10.47733 -9.85121 0.62612 4.23912 -3.24608 0.99304 -17.22884 15.49957 -1.72927
magnitude: 2.09011 au
magnitude: 5.31263 debye
