program: Orca
programVersion: 5.0.2
elementType: S S S S P P O O O O C C C C C C C C C H H H H H H H H H H H H H H H H H H H H H H
charge: 0
multiplicity: 1
keywords: wb97x-d3
keywords: def2-TZVPP
keywords: def2/J RIJCOSX
keywords: DEFGRID2
keywords: scfconv7
keywords: smallprint printgap noloewdin
keywords: NOSOSCF
formula: C9H22O4P2S4
InChI: InChI=1/C9H22O4P2S4/c1-5-10-14(16,11-6-2)18-9-19-15(17,12-7-3)13-8-4/h5-9H2,1-4H3
41 atoms
S  -1.958054 -1.159106 1.313643
S  0.985857 -1.674787 0.719218
S  -1.453379 2.092148 0.441481
S  2.560346 1.238553 1.594017
P  -2.168708 0.390537 -0.087116
P  2.176563 -0.036307 0.202856
O  -1.537466 -0.11816 -1.455373
O  -3.74167 0.280213 -0.353975
O  3.431989 -0.797727 -0.438114
O  1.444201 0.516482 -1.102776
C  -0.242535 -0.937002 1.842583
C  -1.881369 -1.360624 -2.105768
C  -4.711962 1.137005 0.287814
C  4.657209 -1.027448 0.289015
C  1.766605 1.824258 -1.629665
C  -0.701444 -1.80071 -2.931618
C  -4.926778 0.793796 1.740263
C  4.518418 -2.080561 1.359964
C  1.005316 2.015277 -2.914687
H  -0.024729 0.118379 2.018698
H  -0.164092 -1.451179 2.799196
H  -2.134331 -2.119408 -1.362233
H  -2.759325 -1.187778 -2.728603
H  -4.401391 2.176507 0.172003
H  -5.625628 0.992828 -0.285358
H  5.371727 -1.338134 -0.470911
H  5.004583 -0.083476 0.712009
H  1.487259 2.578669 -0.893538
H  2.842529 1.89416 -1.80291
H  -0.976564 -2.692396 -3.494642
H  -0.403251 -1.032986 -3.646109
H  0.154369 -2.048405 -2.304778
H  -4.04404 0.998681 2.345808
H  -5.740532 1.408726 2.126024
H  -5.20769 -0.251071 1.871132
H  3.85846 -1.7614 2.166588
H  4.147654 -3.021999 0.955304
H  5.501369 -2.266831 1.793652
H  1.273948 1.265753 -3.65903
H  -0.071502 1.983433 -2.753049
H  1.251226 2.994868 -3.324543
elementType: S P O C H
totalener: -2932.91214930 hartree
nucrepener: 2784.28438101 hartree
electener: -5717.19653031 hartree
oneelecener: -9592.81732313 hartree
twoeener: 3875.62079283 hartree
cpcmener: -0.02576953 hartree
kineticenergy: 2925.76544726 hartree
xcener: -173.631579698033 hartree
chargesum: 0.0000000
charge: -0.144023 -0.141218 -0.431216 -0.444321 0.643022 0.652933 -0.329115 -0.357763 -0.367929 -0.331966 -0.071767 0.006531 0.035745 0.044259 0.000740 -0.254143 -0.248647 -0.249496 -0.259000 0.117257 0.173387 0.107308 0.112833 0.095399 0.109154 0.110803 0.094005 0.103607 0.127459 0.105391 0.093544 0.079743 0.077094 0.103926 0.092264 0.076847 0.091122 0.103475 0.092738 0.076370 0.103648
qa: -0.1440 -0.1412 -0.4312 -0.4443 0.6430 0.6529 -0.3291 -0.3578 -0.3679 -0.3320 -0.0718 0.0065 0.0357 0.0443 0.0007 -0.2541 -0.2486 -0.2495 -0.2590 0.1173 0.1734 0.1073 0.1128 0.0954 0.1092 0.1108 0.0940 0.1036 0.1275 0.1054 0.0935 0.0797 0.0771 0.1039 0.0923 0.0768 0.0911 0.1035 0.0927 0.0764 0.1036
va: 2.2975 2.2962 2.0231 2.0001 5.4219 5.4042 2.1036 2.1009 2.0903 2.0941 3.8994 3.8486 3.8578 3.8468 3.8355 3.9293 3.8852 3.8942 3.9407 1.0659 0.9921 1.0009 0.9987 1.0114 0.9907 0.9913 1.0136 1.0017 0.9944 1.0111 1.0003 1.0188 1.0179 1.0110 1.0029 1.0165 1.0044 1.0111 1.0018 1.0222 1.0090
dispcorr: -0.025222540 hartree
energy: -2932.937371838019
dipole: -0.20814 -0.35219 -0.56033 -3.23847 1.80259 -1.43588 -10.49726 9.79683 -0.70043
magnitude: 1.69302 au
magnitude: 4.30332 debye
