program: Orca
programVersion: 5.0.2
elementType: S S S S P P O O O O C C C C C C C C C H H H H H H H H H H H H H H H H H H H H H H
charge: 0
multiplicity: 1
keywords: wb97x-d3
keywords: def2-TZVPP
keywords: def2/J RIJCOSX
keywords: DEFGRID2
keywords: scfconv7
keywords: smallprint printgap noloewdin
keywords: NOSOSCF
formula: C9H22O4P2S4
InChI: InChI=1/C9H22O4P2S4/c1-5-10-14(16,11-6-2)18-9-19-15(17,12-7-3)13-8-4/h5-9H2,1-4H3
41 atoms
S  -0.692896 1.349617 1.309634
S  0.986743 -1.212737 1.030943
S  -2.924021 -1.225631 1.544009
S  3.21391 1.362202 0.866581
P  -2.219473 0.198402 0.452647
P  2.322096 -0.054908 -0.083737
O  -3.172929 1.438793 0.129571
O  -1.687799 -0.22281 -0.995066
O  3.243047 -1.198833 -0.720022
O  1.42733 0.362785 -1.335125
C  0.271759 0.049308 2.114796
C  -4.60789 1.305529 0.023118
C  -1.50743 -1.567226 -1.482524
C  4.52855 -1.569343 -0.178929
C  1.814245 1.431698 -2.230941
C  -5.037917 0.539358 -1.20207
C  -2.369244 -1.793205 -2.698304
C  4.41802 -2.404009 1.071767
C  0.929489 2.631828 -2.01614
H  1.060633 0.55817 2.66861
H  -0.350384 -0.493633 2.826496
H  -4.990831 0.83775 0.931898
H  -4.973815 2.329784 -0.007906
H  -0.452409 -1.67448 -1.728234
H  -1.744219 -2.28572 -0.696979
H  5.011877 -2.128371 -0.978107
H  5.115116 -0.667165 0.002848
H  2.865629 1.689415 -2.092114
H  1.702137 1.02985 -3.237033
H  -4.61678 0.963625 -2.112963
H  -4.763538 -0.513731 -1.143584
H  -6.124294 0.589001 -1.280746
H  -2.146316 -2.778585 -3.108703
H  -3.430525 -1.766495 -2.454496
H  -2.169512 -1.057134 -3.477044
H  3.802399 -3.289059 0.912682
H  5.416115 -2.738593 1.355972
H  4.008991 -1.838223 1.908686
H  1.174866 3.394255 -2.75585
H  -0.123271 2.374452 -2.133264
H  1.074348 3.060279 -1.025323
elementType: S P O C H
totalener: -2932.91043245 hartree
nucrepener: 2775.18870856 hartree
electener: -5708.09914101 hartree
oneelecener: -9574.00656617 hartree
twoeener: 3865.90742516 hartree
cpcmener: -0.02381129 hartree
kineticenergy: 2925.78115217 hartree
xcener: -173.637118667903 hartree
chargesum: 0.0000000
charge: -0.136811 -0.141107 -0.445959 -0.449824 0.646335 0.661009 -0.361872 -0.340444 -0.369407 -0.337366 -0.121873 0.037797 0.059464 0.039382 0.044657 -0.247355 -0.256392 -0.246417 -0.246621 0.164763 0.164116 0.095624 0.109876 0.086499 0.098486 0.110618 0.093666 0.091808 0.108601 0.095362 0.072211 0.103768 0.099878 0.090431 0.092700 0.091136 0.102885 0.076969 0.105437 0.082464 0.075506
qa: -0.1368 -0.1411 -0.4460 -0.4498 0.6463 0.6610 -0.3619 -0.3404 -0.3694 -0.3374 -0.1219 0.0378 0.0595 0.0394 0.0447 -0.2474 -0.2564 -0.2464 -0.2466 0.1648 0.1641 0.0956 0.1099 0.0865 0.0985 0.1106 0.0937 0.0918 0.1086 0.0954 0.0722 0.1038 0.0999 0.0904 0.0927 0.0911 0.1029 0.0770 0.1054 0.0825 0.0755
va: 2.3083 2.2987 1.9930 1.9938 5.3960 5.3913 2.0957 2.0577 2.0909 2.0917 3.9132 3.8590 3.7965 3.8602 3.8325 3.8947 3.9689 3.8930 3.9326 1.0184 1.0171 1.0072 0.9907 1.0035 1.0148 0.9908 1.0121 1.0128 0.9964 1.0038 1.0141 1.0103 1.0075 0.9998 1.0037 1.0040 1.0109 1.0167 1.0117 1.0117 1.0122
dispcorr: -0.024194676 hartree
energy: -2932.934627130978
dipole: -4.25330 4.37929 0.12599 -4.18078 3.60549 -0.57529 -18.02328 16.42201 -1.60127
magnitude: 1.70614 au
magnitude: 4.33666 debye
