program: Orca
programVersion: 5.0.2
elementType: S S S S P P O O O O C C C C C C C C C H H H H H H H H H H H H H H H H H H H H H H
charge: 0
multiplicity: 1
keywords: wb97x-d3
keywords: def2-TZVPP
keywords: def2/J RIJCOSX
keywords: DEFGRID2
keywords: scfconv7
keywords: smallprint printgap noloewdin
keywords: NOSOSCF
formula: C9H22O4P2S4
InChI: InChI=1/C9H22O4P2S4/c1-5-10-14(16,11-6-2)18-9-19-15(17,12-7-3)13-8-4/h5-9H2,1-4H3
41 atoms
S  -0.338897 -1.551417 1.027212
S  0.540627 1.404058 1.108789
S  -3.185308 0.314091 1.282992
S  3.379972 -0.458462 0.81432
P  -2.06803 -0.769315 0.15113
P  2.204052 0.822117 -0.015661
O  -1.46954 -0.074569 -1.153539
O  -2.72431 -2.089099 -0.470714
O  1.573709 0.430933 -1.425509
O  2.825772 2.254131 -0.371377
C  0.181838 -0.123057 2.01477
C  -2.130969 1.019316 -1.81997
C  -3.776417 -2.83192 0.183603
C  2.268082 -0.397024 -2.38878
C  3.599244 3.01165 0.581471
C  -3.368881 0.577222 -2.560406
C  -3.280903 -3.642569 1.353939
C  1.665909 -1.777762 -2.423137
C  4.524882 3.925034 -0.177381
H  -0.596261 0.136623 2.731979
H  1.064263 -0.4471 2.566427
H  -2.362329 1.7971 -1.090295
H  -1.383724 1.415424 -2.50501
H  -4.565407 -2.142153 0.488692
H  -4.178455 -3.47762 -0.594741
H  2.155616 0.109835 -3.346679
H  3.334057 -0.43874 -2.159125
H  2.9128 3.57898 1.212269
H  4.165368 2.332223 1.222203
H  -4.149038 0.228738 -1.88243
H  -3.77239 1.425436 -3.114441
H  -3.147209 -0.214829 -3.275189
H  -2.470348 -4.312274 1.066475
H  -2.940101 -3.013797 2.176763
H  -4.102782 -4.254859 1.726635
H  2.149407 -2.358432 -3.209616
H  1.811688 -2.299948 -1.477774
H  0.598395 -1.74409 -2.641359
H  5.235815 3.360106 -0.780261
H  3.975837 4.605151 -0.828653
H  5.091425 4.527689 0.532256
elementType: S P O C H
totalener: -2932.91276541 hartree
nucrepener: 2758.53907716 hartree
electener: -5691.45184257 hartree
oneelecener: -9541.00787484 hartree
twoeener: 3849.55603227 hartree
cpcmener: -0.02426003 hartree
kineticenergy: 2925.77794329 hartree
xcener: -173.633473972116 hartree
chargesum: -0.0000000
charge: -0.135325 -0.141847 -0.446773 -0.451642 0.651550 0.655098 -0.341980 -0.369886 -0.340213 -0.359250 -0.113168 0.042960 0.042471 0.053012 0.037516 -0.241748 -0.250654 -0.254326 -0.240366 0.165437 0.164466 0.094265 0.103515 0.094369 0.111951 0.109986 0.091014 0.101937 0.091349 0.077341 0.099335 0.092205 0.092422 0.077816 0.103922 0.106190 0.077437 0.085510 0.086354 0.089199 0.088554
qa: -0.1353 -0.1418 -0.4468 -0.4516 0.6515 0.6551 -0.3420 -0.3699 -0.3402 -0.3593 -0.1132 0.0430 0.0425 0.0530 0.0375 -0.2417 -0.2507 -0.2543 -0.2404 0.1654 0.1645 0.0943 0.1035 0.0944 0.1120 0.1100 0.0910 0.1019 0.0913 0.0773 0.0993 0.0922 0.0924 0.0778 0.1039 0.1062 0.0774 0.0855 0.0864 0.0892 0.0886
va: 2.3021 2.3094 1.9960 1.9894 5.3941 5.4167 2.0864 2.0826 2.0901 2.1067 3.9020 3.8301 3.8478 3.8160 3.8473 3.9314 3.9033 3.9353 3.9613 1.0178 1.0184 1.0145 0.9940 1.0113 0.9907 0.9966 1.0143 0.9949 1.0058 1.0168 1.0079 1.0055 1.0035 1.0170 1.0106 1.0119 1.0113 1.0114 1.0068 1.0037 1.0064
dispcorr: -0.023001686 hartree
energy: -2932.935767094281
dipole: -1.97484 1.75908 -0.21576 -0.97585 1.13640 0.16055 -13.10139 12.22122 -0.88018
magnitude: 0.92035 au
magnitude: 2.33934 debye
