program: Orca
programVersion: 5.0.2
elementType: S S S S P P O O O O C C C C C C C C C H H H H H H H H H H H H H H H H H H H H H H
charge: 0
multiplicity: 1
keywords: wb97x-d3
keywords: def2-TZVPP
keywords: def2/J RIJCOSX
keywords: DEFGRID2
keywords: scfconv7
keywords: smallprint printgap noloewdin
keywords: NOSOSCF
formula: C9H22O4P2S4
InChI: InChI=1/C9H22O4P2S4/c1-5-10-14(16,11-6-2)18-9-19-15(17,12-7-3)13-8-4/h5-9H2,1-4H3
41 atoms
S  -0.501137 -1.41936 1.104461
S  0.498781 1.48482 0.963952
S  -3.303466 0.510495 0.973264
S  3.301597 -0.413099 1.252115
P  -2.141008 -0.694989 0.021302
P  2.2327 0.685735 0.090184
O  -1.449971 -0.148706 -1.306349
O  -2.777612 -2.060909 -0.511207
O  1.744513 0.043758 -1.281912
O  2.885363 2.026827 -0.480557
C  -0.022569 0.088907 1.991002
C  -1.962904 0.965537 -2.06093
C  -3.887705 -2.722815 0.126003
C  2.058303 -1.299619 -1.697026
C  3.536264 2.974227 0.390644
C  -3.170356 0.588306 -2.882313
C  -3.487492 -3.468096 1.374822
C  3.349631 -1.342844 -2.473609
C  3.436302 4.339012 -0.239501
H  -0.86002 0.448151 2.589098
H  0.781366 -0.201773 2.667487
H  -2.189023 1.791432 -1.384034
H  -1.133554 1.272796 -2.696287
H  -4.670943 -1.99247 0.338557
H  -4.267335 -3.40863 -0.629929
H  2.099127 -1.959233 -0.828964
H  1.214549 -1.610901 -2.3114
H  3.067231 2.973434 1.377857
H  4.576176 2.668555 0.515345
H  -2.957869 -0.248988 -3.547298
H  -4.024734 0.329511 -2.255325
H  -3.46176 1.439805 -3.498742
H  -4.347385 -4.035336 1.733608
H  -2.679824 -4.174294 1.18155
H  -3.180488 -2.795746 2.176137
H  4.200601 -1.058896 -1.85348
H  3.520861 -2.3602 -2.828217
H  3.317584 -0.686817 -3.343889
H  3.903885 4.362637 -1.224232
H  2.398387 4.658284 -0.337197
H  3.951891 5.06336 0.391576
elementType: S P O C H
totalener: -2932.92737327 hartree
nucrepener: 2750.06727124 hartree
electener: -5682.99464451 hartree
oneelecener: -9523.50404571 hartree
twoeener: 3840.50940120 hartree
cpcmener: -0.02005164 hartree
kineticenergy: 2925.76863818 hartree
xcener: -173.632453878796 hartree
chargesum: -0.0000000
charge: -0.140884 -0.149109 -0.443976 -0.442103 0.643733 0.641168 -0.332240 -0.358286 -0.334746 -0.351737 -0.110346 0.043258 0.038860 0.055479 0.024291 -0.240814 -0.248674 -0.239528 -0.234531 0.162794 0.163377 0.091183 0.104413 0.093606 0.108477 0.085066 0.103798 0.092808 0.109600 0.090751 0.078686 0.096881 0.101577 0.092250 0.078866 0.077811 0.094281 0.089677 0.090128 0.085288 0.088865
qa: -0.1409 -0.1491 -0.4440 -0.4421 0.6437 0.6412 -0.3322 -0.3583 -0.3347 -0.3517 -0.1103 0.0433 0.0389 0.0555 0.0243 -0.2408 -0.2487 -0.2395 -0.2345 0.1628 0.1634 0.0912 0.1044 0.0936 0.1085 0.0851 0.1038 0.0928 0.1096 0.0908 0.0787 0.0969 0.1016 0.0922 0.0789 0.0778 0.0943 0.0897 0.0901 0.0853 0.0889
va: 2.2992 2.3016 1.9950 1.9960 5.4082 5.4305 2.0989 2.0970 2.0930 2.1044 3.8949 3.8366 3.8586 3.8207 3.8399 3.9323 3.8984 3.9552 3.9618 1.0206 1.0212 1.0139 0.9931 1.0116 0.9911 1.0143 0.9950 1.0021 1.0020 1.0056 1.0169 1.0081 1.0110 1.0035 1.0170 1.0172 1.0071 1.0057 1.0037 1.0057 1.0071
dispcorr: -0.022445754 hartree
energy: -2932.949819021212
dipole: -1.09328 0.72140 -0.37188 0.21893 -0.25810 -0.03917 -13.40107 12.58828 -0.81279
magnitude: 0.89468 au
magnitude: 2.27410 debye
