program: Gaussian 09
title: 000065718
version: EM64L-G09RevD.01
frameworkgroup: C1[X(C19H20Cl2N2O5)]
method: RPBEPBE
basis: SDD
operation: Freq
keyword: #p
keyword: freq=noraman
keyword: PBEPBE/SDD
title: #p freq=noraman PBEPBE/SDD
converged: YES YES NO NO
title: Mulliken charges:
elementType: Cl Cl O O O O O N N C C C C C C C C C C C C C C C C C C C H H H H H H H H H H H H H H H H H H H H
charge: 0.072058 0.005986 -0.302420 -0.287305 -0.239036 -0.216269 -0.214804 -0.122153 0.021584 -0.538499 -0.386175 0.462236 -0.238340 0.380700 -0.432195 -0.344864 0.324356 -0.378903 -0.370549 -0.728476 -0.203252 0.339179 -0.680023 -0.315891 -0.348612 0.380164 -0.347593 -0.330722 0.239149 0.249572 0.215871 0.250641 0.198561 0.249382 0.255676 0.301571 0.264658 0.265523 0.363596 0.199139 0.196318 0.214478 0.230774 0.219875 0.276587 0.270075 0.287546 0.290823
chargesum: 0.00000
title: Mulliken charges with hydrogens summed into heavy atoms:
elementType: Cl Cl O O O O O N N C C C C C C C C C C C C C C C C C C C
charge: 0.072058 0.005986 -0.302420 -0.287305 -0.239036 -0.216269 -0.214804 -0.122153 0.021584 -0.049778 0.080337 0.462236 0.209603 0.380700 -0.176518 -0.043293 0.324356 -0.114244 -0.105026 -0.364880 0.192205 0.339179 -0.014896 -0.039303 -0.078537 0.380164 -0.060047 -0.039899
polarizability: 3.90862659e+02 2.13672346e+01 2.43966302e+02 2.65307526e+01 -1.14468793e+01 1.97232415e+02
1716.lowfreq: -0.9176 -0.0017 -0.0013 0.0014 3.3185 5.1952 9.3700 15.5217 20.9333
frequency: 9.0418 15.3520 20.8821 28.0553 35.1400 39.7508 50.0866 56.9829 63.4794 72.4285 76.1869 81.4740 109.9860 121.4283 136.7208 161.7459 170.5416 186.9867 189.8414 226.0232 232.2244 242.6311 247.2730 279.1781 294.2232 310.0454 322.3032 347.1924 361.8072 401.2275 405.3020 414.2913 417.2725 419.7086 439.1419 485.9014 500.0281 504.7316 511.7104 568.5046 577.4967 613.4486 621.9543 629.9671 648.7325 664.3337 716.6617 721.6519 733.4784 736.9434 750.1997 778.0678 781.8833 790.2974 812.5879 815.0885 830.7332 842.1721 849.6887 859.8680 866.0968 888.4502 920.8088 958.8596 981.5340 984.5315 989.4984 994.3065 996.2651 1007.9441 1013.9161 1045.0101 1070.9433 1078.5173 1095.2023 1108.1713 1111.7430 1119.3121 1139.3713 1153.3735 1165.0773 1167.3869 1177.3272 1198.0136 1203.3942 1215.8389 1222.0067 1223.8211 1232.3731 1253.9436 1259.9764 1287.7664 1301.3240 1309.1694 1328.3836 1338.3169 1356.0190 1363.8550 1382.7750 1389.6700 1397.6797 1402.7858 1403.9242 1420.2190 1431.8739 1444.0225 1462.6238 1471.2204 1471.6308 1474.4131 1480.1159 1493.4504 1497.3345 1586.6782 1593.8195 1595.1869 1603.9780 1620.6124 2929.7865 2942.2578 2979.6964 2993.2855 2993.8261 3012.9600 3024.2945 3059.4164 3088.1654 3090.4407 3099.0277 3114.4405 3127.0911 3129.0207 3151.8038 3166.7064 3170.7199 3172.9542 3186.3964 3190.5477
redmass: 7.2587 6.1228 6.9462 5.7188 9.9114 10.4531 4.2253 2.4793 5.0868 5.2937 4.1799 4.9237 7.9904 5.0853 7.0727 6.2609 4.0188 6.4397 4.9390 4.6021 6.7771 1.3161 4.5221 6.4467 9.1154 6.1523 3.9073 6.2772 5.3981 3.2383 2.8294 2.9703 3.3785 3.1270 4.7451 3.3865 3.8625 4.2023 3.9741 5.6111 6.6302 6.6834 6.3904 6.3736 5.5771 4.8649 4.4401 5.2139 5.2283 5.8093 7.6609 6.0311 2.7559 5.0218 4.5152 1.1386 1.2745 1.5457 1.7601 2.7533 1.5896 2.6684 2.0231 1.4322 1.3387 1.6937 1.3531 3.3905 2.8966 1.9491 1.7801 2.8599 3.7570 2.4564 3.2349 1.2677 1.7290 1.6020 1.4627 2.3170 1.7207 1.9579 1.3213 1.5089 1.1934 2.3143 4.3793 1.2875 5.4769 1.1427 1.3275 1.2770 1.4019 1.3200 1.7297 1.2597 7.6725 1.2850 3.3773 1.3727 1.7349 1.4399 7.6815 2.4840 4.2559 1.1548 1.0432 1.5548 1.4091 1.1919 1.0537 1.1830 1.9194 7.3351 7.5382 7.5915 6.3958 6.2559 1.0560 1.0614 1.1067 1.0632 1.0363 1.0770 1.0828 1.0988 1.1028 1.0993 1.1006 1.0934 1.0901 1.0880 1.0943 1.0890 1.0893 1.0952 1.0961 1.0974
irintensity: 0.9366 1.2226 0.7039 0.0721 0.1064 0.3127 0.6963 2.2393 0.4040 4.4988 3.3763 0.0779 4.4910 3.5077 2.8179 0.8148 10.1177 0.3560 2.2958 2.8318 0.7363 0.2441 2.7826 2.4091 0.6400 1.9396 2.8898 0.5501 3.5442 0.8667 9.8895 0.7733 2.5486 5.9898 5.5200 12.9828 8.4042 3.7232 10.2677 26.6741 51.8322 16.0708 7.6358 19.7628 5.1726 22.0497 1.5178 5.9936 12.0653 2.8331 92.3818 9.7479 11.8509 17.2934 0.3222 3.6329 2.7654 38.6079 37.9937 83.4323 28.9943 13.0450 24.8460 3.4464 3.6508 8.1030 0.7004 33.7402 2.7618 7.3255 18.7577 21.6889 115.2269 7.3727 18.7975 17.9553 37.5740 4.8707 5.5312 9.3635 252.7086 132.8853 21.2187 7.7705 9.5573 105.0199 744.9410 33.6434 150.7789 0.6653 6.0958 3.2767 32.7638 12.1276 23.9195 21.6212 87.9643 14.5166 28.5700 12.2576 36.4662 1.2347 19.3850 8.8407 15.8344 18.7535 11.7722 95.5916 96.4735 32.9339 4.6781 14.9125 120.3553 27.1710 43.7637 265.7006 204.1811 12.7142 47.5337 100.7475 49.1374 21.1365 17.3758 3.6261 53.0895 4.8879 11.8574 51.5129 32.5783 39.1459 9.1473 10.9477 11.4213 1.5326 0.5774 3.4084 0.9821 4.3008
temp: 298.150 k
press: 1.00000 atm
elementType: 17 17 8 8 8 8 8 7 7 6 6 6 6 6 6 6 6 6 6 6 6 6 6 6 6 6 6 6 1 1 1 1 1 1 1 1 1 1 1 1 1 1 1 1 1 1 1 1
symmnumber: 1
zpe: 949277.4 jmol-1
zpe.correction: 0.361561 hartree
zpe.thermalcorrener: 0.389349 hartree
zpe.thermalcorrenthalpy: 0.390294 hartree
zpe.thermalcorrgfe: 0.297023 hartree
zpe.sumelectzpe: -2139.592188 hartree
zpe.sumelectthermal: -2139.564399 hartree
zpe.sumelectthermalent: -2139.563455 hartree
zpe.sumelectthermalfe: -2139.656726 hartree
dipole: -2.8763 2.1510 -2.6643
dipole: 4.4720
quadrupole: -263.7546 -162.4954 -174.5034
quadrupole: -23.9040 15.7452 3.9161
quadrupole: -63.5035 37.7557 25.7477 -23.9040 15.7452 3.9161
hfenergy: -2139.9537489 hartree
pointgroup: C01 [X(C19H20Cl2N2O5)]
dipole: 1.5833774 -0.1497049 0.7523466 debye
polarizability: 362.4061961|-34.6874874|220.3228039|-53.3959371|42.5501061|249.3323766 unknown
InChI: InChI=1S/C19H20Cl2N2O5/c1-2-27-12-11-22(19(24)18(20)21)13-14-3-7-16(8-4-14)28-17-9-5-15(6-10-17)23(25)26/h3-10,18H,2,11-13H2,1H3
charge 0 multiplicity 1
48 atoms
Cl 3.253967 -0.971652 -4.63809
Cl 4.604553 -3.081292 -2.873774
O  3.538075 2.008563 0.950476
O  -2.159867 -1.496017 -0.441587
O  5.085703 0.481105 -2.764744
O  -5.623918 1.051183 4.294231
O  -7.176587 0.929861 2.624506
N  4.32623 -0.424827 -0.763723
N  -5.981494 0.753684 3.086711
C  3.592894 -1.457948 0.022909
C  5.208349 0.543399 -0.057095
C  2.069861 -1.439572 -0.106853
C  4.663715 1.974687 0.004855
C  4.396068 -0.384625 -2.151922
C  1.365598 -2.643059 -0.361106
C  1.339695 -0.234997 0.065412
C  -0.747491 -1.449342 -0.252173
C  -0.045317 -2.656461 -0.431625
C  -0.067363 -0.232723 -0.013886
C  3.601414 -1.472395 -2.904821
C  3.043405 3.379858 1.175754
C  -3.037984 -0.898544 0.475134
C  1.896436 3.309945 2.183198
C  -2.683722 -0.578128 1.811567
C  -4.356616 -0.687844 -0.001329
C  -4.96583 0.179662 2.183538
C  -3.656618 -0.036514 2.669572
C  -5.327491 -0.145857 0.85456
H  3.857506 -1.272924 1.078561
H  3.974802 -2.464292 -0.236298
H  5.376841 0.175724 0.969445
H  6.175635 0.577461 -0.590832
H  5.474551 2.647255 0.362893
H  4.346678 2.314268 -1.001116
H  1.91855 -3.579525 -0.504107
H  1.88898 0.692721 0.268444
H  -0.600572 -3.576863 -0.633269
H  -0.630297 0.700071 0.09723
H  2.63975 -1.73112 -2.447143
H  3.874156 4.008552 1.565001
H  2.705835 3.818008 0.210916
H  1.508677 4.323323 2.392049
H  2.240369 2.865054 3.132723
H  1.065514 2.695664 1.793636
H  -1.670673 -0.764786 2.177749
H  -4.592045 -0.954869 -1.035044
H  -3.423953 0.215728 3.707362
H  -6.35187 0.032599 0.518209
