program: Orca
programVersion: 5.0.2
elementType: S S S S P P O O O O C C C C C C C C C H H H H H H H H H H H H H H H H H H H H H H
charge: 0
multiplicity: 1
keywords: wb97x-d3
keywords: def2-TZVPP
keywords: def2/J RIJCOSX
keywords: DEFGRID2
keywords: scfconv7
keywords: smallprint printgap noloewdin
keywords: NOSOSCF
formula: C9H22O4P2S4
InChI: InChI=1/C9H22O4P2S4/c1-5-10-14(16,11-6-2)18-9-19-15(17,12-7-3)13-8-4/h5-9H2,1-4H3
41 atoms
S  -0.61118 -1.615077 0.618513
S  0.686471 1.147617 0.979551
S  -3.358747 0.272184 1.350654
S  3.385788 -0.90925 1.179894
P  -2.377044 -0.682007 -0.00616
P  2.467005 0.412589 0.130883
O  -1.879491 0.171759 -1.259592
O  -3.116342 -1.905357 -0.724027
O  2.138497 -0.116847 -1.330508
O  3.198132 1.800912 -0.172673
C  0.038111 -0.35688 1.747777
C  -2.542598 1.376367 -1.696055
C  -4.14474 -2.69071 -0.083935
C  1.482309 0.676409 -2.345682
C  3.808575 2.589514 0.873564
C  -3.860222 1.098814 -2.375486
C  -3.601881 -3.648013 0.947113
C  2.468374 1.088656 -3.408952
C  5.306722 2.422164 0.861454
H  -0.744725 -0.03904 2.437511
H  0.822504 -0.843002 2.329358
H  -2.669008 2.04707 -0.844087
H  -1.839058 1.840646 -2.385615
H  -4.886764 -2.021211 0.355593
H  -4.621761 -3.229993 -0.900735
H  0.703204 0.037716 -2.759683
H  0.994374 1.54839 -1.904923
H  3.523316 3.621531 0.668609
H  3.392741 2.321507 1.849009
H  -4.601994 0.696929 -1.684415
H  -4.256178 2.034192 -2.77332
H  -3.744926 0.404525 -3.20805
H  -2.83073 -4.297083 0.531677
H  -3.193683 -3.131745 1.816159
H  -4.418088 -4.281993 1.295897
H  1.934955 1.610935 -4.204226
H  3.230997 1.763022 -3.020058
H  2.961705 0.2239 -3.85336
H  5.73241 2.68829 -0.107397
H  5.744886 3.082544 1.611203
H  5.598092 1.399462 1.10319
elementType: S P O C H
totalener: -2932.92837023 hartree
nucrepener: 2708.36012051 hartree
electener: -5641.28849074 hartree
oneelecener: -9439.67312474 hartree
twoeener: 3798.38463400 hartree
cpcmener: -0.02265277 hartree
kineticenergy: 2925.72846619 hartree
xcener: -173.622910490088 hartree
chargesum: -0.0000000
charge: -0.130382 -0.158626 -0.445041 -0.431970 0.632380 0.629737 -0.334267 -0.356681 -0.331107 -0.337917 -0.120848 0.038774 0.043674 0.052265 0.030555 -0.238705 -0.250449 -0.249383 -0.234367 0.164083 0.166519 0.095820 0.103557 0.093889 0.109361 0.103928 0.087233 0.110550 0.088136 0.079771 0.097554 0.091166 0.092976 0.078874 0.102285 0.092941 0.084497 0.090282 0.090025 0.093230 0.075684
qa: -0.1304 -0.1586 -0.4450 -0.4320 0.6324 0.6297 -0.3343 -0.3567 -0.3311 -0.3379 -0.1208 0.0388 0.0437 0.0523 0.0306 -0.2387 -0.2504 -0.2494 -0.2344 0.1641 0.1665 0.0958 0.1036 0.0939 0.1094 0.1039 0.0872 0.1106 0.0881 0.0798 0.0976 0.0912 0.0930 0.0789 0.1023 0.0929 0.0845 0.0903 0.0900 0.0932 0.0757
va: 2.3156 2.2907 1.9940 2.0299 5.4184 5.4514 2.1039 2.0947 2.1103 2.0838 3.9026 3.8398 3.8465 3.8356 3.8473 3.9238 3.9041 3.9563 3.9446 1.0237 1.0215 1.0137 0.9887 1.0115 0.9910 0.9987 1.0033 0.9930 1.0096 1.0172 1.0080 1.0060 1.0031 1.0168 1.0110 1.0066 1.0131 1.0037 1.0033 1.0078 1.0186
dispcorr: -0.022363769 hartree
energy: -2932.950734001409
dipole: -2.84343 1.82799 -1.01543 7.59474 -6.15516 1.43958 -13.12857 12.01679 -1.11178
magnitude: 2.08316 au
magnitude: 5.29497 debye
