program: Orca
programVersion: 5.0.2
elementType: S S S S P P O O O O C C C C C C C C C H H H H H H H H H H H H H H H H H H H H H H
charge: 0
multiplicity: 1
keywords: wb97x-d3
keywords: def2-TZVPP
keywords: def2/J RIJCOSX
keywords: DEFGRID2
keywords: scfconv7
keywords: smallprint printgap noloewdin
keywords: NOSOSCF
formula: C9H22O4P2S4
InChI: InChI=1/C9H22O4P2S4/c1-5-10-14(16,11-6-2)18-9-19-15(17,12-7-3)13-8-4/h5-9H2,1-4H3
41 atoms
S  -0.952041 1.440495 1.045466
S  0.90608 -1.008565 1.096245
S  -2.898232 -1.314084 1.464867
S  3.256391 1.469007 0.957372
P  -2.346749 0.087414 0.263824
P  2.276281 0.119278 -0.007268
O  -3.454399 1.122136 -0.2472
O  -1.726868 -0.363683 -1.131235
O  3.115689 -1.059019 -0.690703
O  1.378312 0.629298 -1.220457
C  0.075756 0.311086 2.019674
C  -4.373634 1.741713 0.677583
C  -1.770768 -1.717868 -1.624141
C  4.417169 -1.472676 -0.227984
C  1.68422 1.819282 -1.970711
C  -5.720595 1.06663 0.628957
C  -0.704245 -1.877103 -2.676197
C  4.352207 -2.306635 1.027335
C  2.890832 1.647816 -2.86011
H  0.811549 0.929886 2.535071
H  -0.533062 -0.189122 2.772639
H  -3.968546 1.728805 1.692336
H  -4.443732 2.784059 0.36944
H  -1.609908 -2.416365 -0.802092
H  -2.763372 -1.906599 -2.03718
H  4.83393 -2.045731 -1.054815
H  5.045574 -0.592075 -0.081599
H  0.788006 2.009006 -2.559073
H  1.81655 2.656407 -1.282643
H  -6.413861 1.604068 1.277328
H  -6.133902 1.071745 -0.37954
H  -5.664505 0.036286 0.978299
H  -0.826727 -1.163644 -3.49139
H  0.295079 -1.76346 -2.257409
H  -0.776258 -2.879761 -3.098655
H  4.004508 -1.730942 1.885167
H  3.705712 -3.17503 0.902298
H  5.354375 -2.669006 1.259659
H  3.810569 1.531254 -2.285525
H  2.781609 0.789763 -3.523427
H  3.003417 2.53762 -3.480621
elementType: S P O C H
totalener: -2932.92634378 hartree
nucrepener: 2758.72059772 hartree
electener: -5691.64694150 hartree
oneelecener: -9540.90228880 hartree
twoeener: 3849.25534730 hartree
cpcmener: -0.02028837 hartree
kineticenergy: 2925.77473468 hartree
xcener: -173.633528225398 hartree
chargesum: -0.0000000
charge: -0.144930 -0.136100 -0.447567 -0.439311 0.652051 0.633713 -0.358170 -0.331989 -0.356094 -0.329458 -0.114114 0.045725 0.020610 0.045352 0.034729 -0.240180 -0.236698 -0.249231 -0.237483 0.159382 0.164935 0.083890 0.109688 0.097274 0.118792 0.108448 0.091598 0.104129 0.095442 0.093574 0.089237 0.076121 0.092760 0.066997 0.097223 0.079194 0.092213 0.101338 0.077910 0.091452 0.097545
qa: -0.1449 -0.1361 -0.4476 -0.4393 0.6521 0.6337 -0.3582 -0.3320 -0.3561 -0.3295 -0.1141 0.0457 0.0206 0.0454 0.0347 -0.2402 -0.2367 -0.2492 -0.2375 0.1594 0.1649 0.0839 0.1097 0.0973 0.1188 0.1084 0.0916 0.1041 0.0954 0.0936 0.0892 0.0761 0.0928 0.0670 0.0972 0.0792 0.0922 0.1013 0.0779 0.0915 0.0975
va: 2.2992 2.3103 1.9902 2.0115 5.4279 5.4013 2.1008 2.0976 2.0763 2.0967 3.9086 3.8518 3.8305 3.8467 3.8385 3.9443 3.9392 3.9052 3.9253 1.0242 1.0159 1.0103 0.9927 1.0050 0.9956 0.9901 1.0119 0.9929 1.0151 1.0076 1.0039 1.0186 1.0034 1.0234 1.0095 1.0174 1.0034 1.0112 1.0165 1.0052 1.0089
dispcorr: -0.023205024 hartree
energy: -2932.949548800574
dipole: 2.46970 -2.22909 0.24061 -3.76006 3.75288 -0.00718 -13.69460 12.71783 -0.97677
magnitude: 1.00600 au
magnitude: 2.55704 debye
