program: Orca
programVersion: 5.0.2
elementType: S S S S P P O O O O C C C C C C C C C H H H H H H H H H H H H H H H H H H H H H H
charge: 0
multiplicity: 1
keywords: wb97x-d3
keywords: def2-TZVPP
keywords: def2/J RIJCOSX
keywords: DEFGRID2
keywords: scfconv7
keywords: smallprint printgap noloewdin
keywords: NOSOSCF
formula: C9H22O4P2S4
InChI: InChI=1/C9H22O4P2S4/c1-5-10-14(16,11-6-2)18-9-19-15(17,12-7-3)13-8-4/h5-9H2,1-4H3
41 atoms
S  -1.055176 1.590757 0.616946
S  1.895358 1.27527 1.266183
S  -2.578785 -1.338507 1.532146
S  1.800538 -2.033511 0.420872
P  -2.186869 -0.092615 0.115085
P  2.316854 -0.26026 -0.107977
O  -3.434685 0.626276 -0.585107
O  -1.386477 -0.664264 -1.139392
O  1.669632 0.149883 -1.501088
O  3.871743 0.03919 -0.328252
C  0.195101 0.882333 1.73846
C  -4.693779 0.833051 0.087148
C  -1.50067 -2.034601 -1.574096
C  1.877143 1.416378 -2.157857
C  4.923743 -0.69953 0.326882
C  -4.640799 1.941178 1.108945
C  -2.844128 -2.338432 -2.190657
C  0.746398 1.630846 -3.129597
C  5.064833 -0.351847 1.787532
H  0.051079 1.327682 2.721883
H  0.064564 -0.196172 1.847993
H  -5.394015 1.074667 -0.710995
H  -5.01692 -0.104414 0.543934
H  -0.699383 -2.156708 -2.300724
H  -1.292333 -2.697051 -0.732577
H  1.907936 2.221956 -1.420338
H  2.839138 1.389228 -2.672361
H  4.748566 -1.768705 0.193364
H  5.82589 -0.436792 -0.223282
H  -4.297423 2.878598 0.671003
H  -5.646636 2.104368 1.498615
H  -3.998638 1.692924 1.954204
H  -2.824481 -3.349939 -2.598543
H  -3.650598 -2.29929 -1.457098
H  -3.078802 -1.653958 -3.006008
H  -0.212641 1.704532 -2.617501
H  0.912779 2.564525 -3.667605
H  0.690502 0.828049 -3.865304
H  4.199339 -0.665961 2.371109
H  5.935751 -0.873783 2.186601
H  5.220179 0.716778 1.936706
elementType: S P O C H
totalener: -2932.92590588 hartree
nucrepener: 2759.45341078 hartree
electener: -5692.37931666 hartree
oneelecener: -9542.70170356 hartree
twoeener: 3850.32238690 hartree
cpcmener: -0.02155012 hartree
kineticenergy: 2925.74093613 hartree
xcener: -173.626291147578 hartree
chargesum: -0.0000000
charge: -0.142759 -0.148032 -0.438019 -0.427327 0.636698 0.640281 -0.360082 -0.330399 -0.322227 -0.352900 -0.069265 0.045886 0.039353 0.001315 0.032795 -0.249624 -0.241708 -0.235124 -0.246213 0.170227 0.111054 0.109552 0.093171 0.101310 0.091499 0.103264 0.112205 0.095361 0.107017 0.091564 0.101541 0.078138 0.097854 0.078427 0.091336 0.073224 0.096184 0.092892 0.078639 0.101543 0.091351
qa: -0.1428 -0.1480 -0.4380 -0.4273 0.6367 0.6403 -0.3601 -0.3304 -0.3222 -0.3529 -0.0693 0.0459 0.0394 0.0013 0.0328 -0.2496 -0.2417 -0.2351 -0.2462 0.1702 0.1111 0.1096 0.0932 0.1013 0.0915 0.1033 0.1122 0.0954 0.1070 0.0916 0.1015 0.0781 0.0979 0.0784 0.0913 0.0732 0.0962 0.0929 0.0786 0.1015 0.0914
va: 2.2941 2.2952 2.0024 2.0245 5.4149 5.4245 2.0847 2.1031 2.1120 2.1059 3.9003 3.8440 3.8337 3.8597 3.8663 3.9084 3.9379 3.9288 3.8850 0.9940 1.0697 0.9904 1.0121 0.9949 1.0135 1.0013 0.9979 1.0103 0.9904 1.0038 1.0113 1.0165 1.0080 1.0161 1.0061 1.0212 1.0097 1.0035 1.0184 1.0115 1.0030
dispcorr: -0.024470054 hartree
energy: -2932.950375936519
dipole: -3.75566 4.15335 0.39769 2.83512 -1.45495 1.38017 -9.37144 8.62045 -0.75098
magnitude: 1.62080 au
magnitude: 4.11975 debye
