program: Orca
programVersion: 5.0.2
elementType: S S S S P P O O O O C C C C C C C C C H H H H H H H H H H H H H H H H H H H H H H
charge: 0
multiplicity: 1
keywords: wb97x-d3
keywords: def2-TZVPP
keywords: def2/J RIJCOSX
keywords: DEFGRID2
keywords: scfconv7
keywords: smallprint printgap noloewdin
keywords: NOSOSCF
formula: C9H22O4P2S4
InChI: InChI=1/C9H22O4P2S4/c1-5-10-14(16,11-6-2)18-9-19-15(17,12-7-3)13-8-4/h5-9H2,1-4H3
41 atoms
S  -0.536166 -1.330006 0.815081
S  0.415015 1.580928 0.671108
S  -3.520126 0.13621 1.534556
S  3.369256 -0.038283 1.199511
P  -2.473932 -0.780694 0.208163
P  2.279863 0.957835 -0.039774
O  -2.345168 0.063082 -1.132254
O  -2.984158 -2.197271 -0.327964
O  1.881053 0.225844 -1.400153
O  2.886107 2.331756 -0.588072
C  -0.037615 0.164195 1.705355
C  -1.609148 -0.386287 -2.291091
C  -3.437858 -3.233688 0.570834
C  2.860936 -0.526338 -2.153458
C  3.81992 3.141602 0.153336
C  -1.197141 0.822455 -3.089084
C  -4.943379 -3.295486 0.597731
C  2.628742 -2.005504 -1.985739
C  3.170638 3.906132 1.280098
H  -0.848413 0.500306 2.353527
H  0.804501 -0.113967 2.340016
H  -0.732307 -0.959288 -1.981981
H  -2.253704 -1.043781 -2.876444
H  -3.010771 -4.160828 0.190387
H  -3.036509 -3.075001 1.57495
H  2.733012 -0.21911 -3.191059
H  3.874997 -0.253523 -1.852596
H  4.629651 2.509947 0.523803
H  4.238682 3.822393 -0.586349
H  -0.647014 0.494257 -3.971621
H  -2.061257 1.394073 -3.428849
H  -0.547861 1.481168 -2.513247
H  -5.254778 -4.13409 1.221877
H  -5.375018 -2.38683 1.016467
H  -5.355157 -3.451373 -0.399689
H  1.621926 -2.289289 -2.294189
H  3.335997 -2.553477 -2.609639
H  2.778005 -2.318967 -0.952607
H  2.340773 4.519343 0.928262
H  2.808351 3.2484 2.070413
H  3.912478 4.572583 1.722208
elementType: S P O C H
totalener: -2932.92892614 hartree
nucrepener: 2721.82586047 hartree
electener: -5654.75478662 hartree
oneelecener: -9466.53203301 hartree
twoeener: 3811.77724639 hartree
cpcmener: -0.02186522 hartree
kineticenergy: 2925.74451346 hartree
xcener: -173.625144914100 hartree
chargesum: -0.0000000
charge: -0.153444 -0.131184 -0.430689 -0.444448 0.626067 0.640901 -0.324588 -0.341832 -0.329908 -0.357835 -0.119697 0.030341 0.039375 0.037258 0.038028 -0.238527 -0.235451 -0.249111 -0.247392 0.165360 0.164625 0.076444 0.115267 0.109834 0.086503 0.107969 0.095537 0.094943 0.108672 0.091840 0.098906 0.072917 0.093312 0.076173 0.089685 0.090652 0.102793 0.079181 0.092103 0.077849 0.101571
qa: -0.1534 -0.1312 -0.4307 -0.4444 0.6261 0.6409 -0.3246 -0.3418 -0.3299 -0.3578 -0.1197 0.0303 0.0394 0.0373 0.0380 -0.2385 -0.2355 -0.2491 -0.2474 0.1654 0.1646 0.0764 0.1153 0.1098 0.0865 0.1080 0.0955 0.0949 0.1087 0.0918 0.0989 0.0729 0.0933 0.0762 0.0897 0.0907 0.1028 0.0792 0.0921 0.0778 0.1016
va: 2.2928 2.3062 2.0309 1.9973 5.4573 5.4082 2.1221 2.0842 2.0962 2.1025 3.9004 3.8468 3.8448 3.8422 3.8580 3.9362 3.9407 3.9339 3.8970 1.0249 1.0226 1.0078 1.0004 0.9930 1.0091 0.9956 1.0095 1.0117 0.9907 1.0063 1.0063 1.0218 1.0079 1.0188 1.0040 0.9987 1.0110 1.0155 1.0038 1.0169 1.0111
dispcorr: -0.023200671 hartree
energy: -2932.952126814652
dipole: 4.11202 -2.77991 1.33210 -4.40495 3.60331 -0.80164 -12.73909 11.27596 -1.46313
magnitude: 2.13492 au
magnitude: 5.42654 debye
