program: Orca
programVersion: 5.0.2
elementType: S S S S P P O O O O C C C C C C C C C H H H H H H H H H H H H H H H H H H H H H H
charge: 0
multiplicity: 1
keywords: wb97x-d3
keywords: def2-TZVPP
keywords: def2/J RIJCOSX
keywords: DEFGRID2
keywords: scfconv7
keywords: smallprint printgap noloewdin
keywords: NOSOSCF
formula: C9H22O4P2S4
InChI: InChI=1/C9H22O4P2S4/c1-5-10-14(16,11-6-2)18-9-19-15(17,12-7-3)13-8-4/h5-9H2,1-4H3
41 atoms
S  -0.249594 -1.127503 1.603666
S  0.402435 1.718951 0.615183
S  -3.282189 0.390705 1.22681
S  3.434229 0.228463 1.126686
P  -2.041821 -0.911531 0.536563
P  2.165501 0.897398 -0.157761
O  -1.650647 -0.752899 -1.005293
O  -2.441478 -2.455061 0.624205
O  1.590571 -0.133091 -1.228146
O  2.667915 2.085828 -1.104212
C  0.097467 0.599833 2.00732
C  -1.868592 0.414046 -1.819589
C  -3.812067 -2.901804 0.553371
C  2.419671 -1.147183 -1.83836
C  3.655641 3.053973 -0.698485
C  -2.687116 0.042931 -3.029689
C  -4.441275 -2.675761 -0.798319
C  2.034549 -2.507898 -1.320148
C  3.121747 4.071728 0.278531
H  -0.740271 1.032878 2.554782
H  0.962548 0.583979 2.670731
H  -2.366489 1.191453 -1.238069
H  -0.888065 0.788539 -2.110336
H  -3.762181 -3.964488 0.78645
H  -4.387908 -2.411755 1.341305
H  2.246295 -1.066241 -2.911079
H  3.477306 -0.943917 -1.65786
H  4.521386 2.532373 -0.285831
H  3.964735 3.534426 -1.626006
H  -2.216114 -0.752633 -3.607992
H  -3.694579 -0.271505 -2.757591
H  -2.774096 0.916545 -3.677225
H  -3.845503 -3.111738 -1.600024
H  -5.420638 -3.155923 -0.811132
H  -4.595516 -1.617424 -1.008305
H  2.604768 -3.269544 -1.853593
H  2.252097 -2.6058 -0.257342
H  0.974883 -2.709031 -1.478651
H  2.234708 4.575601 -0.105498
H  2.881896 3.631007 1.246157
H  3.888717 4.829658 0.444505
elementType: S P O C H
totalener: -2932.92460199 hartree
nucrepener: 2766.83594883 hartree
electener: -5699.76055081 hartree
oneelecener: -9557.04310477 hartree
twoeener: 3857.28255396 hartree
cpcmener: -0.02013201 hartree
kineticenergy: 2925.76631156 hartree
xcener: -173.633177890704 hartree
chargesum: -0.0000000
charge: -0.132929 -0.139731 -0.443158 -0.445353 0.640914 0.650413 -0.330242 -0.354474 -0.326660 -0.360996 -0.125833 0.055344 0.033551 0.042304 0.034514 -0.253175 -0.246574 -0.241512 -0.247669 0.164021 0.163177 0.097131 0.085328 0.108061 0.095782 0.105839 0.090015 0.094322 0.108356 0.092149 0.087602 0.097748 0.095272 0.102203 0.071777 0.102041 0.076914 0.081588 0.092072 0.078105 0.101764
qa: -0.1329 -0.1397 -0.4432 -0.4454 0.6409 0.6504 -0.3302 -0.3545 -0.3267 -0.3610 -0.1258 0.0553 0.0336 0.0423 0.0345 -0.2532 -0.2466 -0.2415 -0.2477 0.1640 0.1632 0.0971 0.0853 0.1081 0.0958 0.1058 0.0900 0.0943 0.1084 0.0921 0.0876 0.0977 0.0953 0.1022 0.0718 0.1020 0.0769 0.0816 0.0921 0.0781 0.1018
va: 2.3115 2.2962 1.9946 1.9977 5.4026 5.4014 2.0697 2.1053 2.1000 2.0995 3.9160 3.8066 3.8662 3.8419 3.8659 3.9688 3.8919 3.9332 3.8906 1.0173 1.0189 1.0137 1.0034 0.9905 1.0067 0.9960 1.0121 1.0116 0.9906 1.0035 1.0012 1.0081 1.0040 1.0107 1.0153 1.0118 1.0123 1.0113 1.0036 1.0168 1.0113
dispcorr: -0.024008660 hartree
energy: -2932.948610646120
dipole: -4.20492 4.24050 0.03558 -2.33069 2.46971 0.13902 -18.16398 16.51541 -1.64857
magnitude: 1.65481 au
magnitude: 4.20618 debye
