program: Orca
programVersion: 5.0.2
elementType: S S S S P P O O O O C C C C C C C C C H H H H H H H H H H H H H H H H H H H H H H
charge: 0
multiplicity: 1
keywords: wb97x-d3
keywords: def2-TZVPP
keywords: def2/J RIJCOSX
keywords: DEFGRID2
keywords: scfconv7
keywords: smallprint printgap noloewdin
keywords: NOSOSCF
formula: C9H22O4P2S4
InChI: InChI=1/C9H22O4P2S4/c1-5-10-14(16,11-6-2)18-9-19-15(17,12-7-3)13-8-4/h5-9H2,1-4H3
41 atoms
S  -0.444772 -1.547964 0.834195
S  0.277145 1.441068 1.090202
S  -3.43875 0.078086 1.007169
S  3.202632 -0.304441 1.076441
P  -2.196739 -0.888606 -0.098593
P  2.022897 0.857118 0.096692
O  -1.626472 -0.135803 -1.380088
O  -2.714779 -2.266167 -0.734987
O  1.461453 0.321449 -1.293011
O  2.599668 2.29045 -0.328924
C  -0.120994 -0.125657 1.910152
C  -2.320596 0.918801 -2.057616
C  -3.746443 -3.053719 -0.129304
C  2.026024 -0.79049 -1.994361
C  3.647769 2.939745 0.40161
C  -1.302757 1.847373 -2.674379
C  -3.270989 -3.806824 1.092681
C  3.286485 -0.408139 -2.7362
C  3.189589 3.487146 1.734175
H  -0.998415 0.075411 2.524697
H  0.710699 -0.425219 2.547524
H  -2.964413 0.475631 -2.821289
H  -2.957335 1.456277 -1.351397
H  -4.594416 -2.412289 0.121153
H  -4.06345 -3.743204 -0.911177
H  2.215508 -1.607167 -1.294785
H  1.241924 -1.110571 -2.678979
H  4.479129 2.244496 0.539057
H  3.983759 3.742621 -0.253697
H  -1.820212 2.635551 -3.221817
H  -0.68196 2.310825 -1.910058
H  -0.650871 1.323959 -3.372493
H  -3.019285 -3.13013 1.908511
H  -4.067216 -4.465244 1.441042
H  -2.398143 -4.420363 0.871717
H  3.114091 0.433373 -3.406429
H  4.087957 -0.146085 -2.045307
H  3.630363 -1.252288 -3.334753
H  2.921327 2.689261 2.425695
H  4.002672 4.056701 2.185505
H  2.333108 4.151203 1.623364
totalener: -2932.90288211 hartree
nucrepener: 2780.87062268 hartree
electener: -5713.77350479 hartree
oneelecener: -9584.25987062 hartree
twoeener: 3870.48636584 hartree
kineticenergy: 2925.83262572 hartree
xcener: -173.646383551710 hartree
chargesum: 0.0000000
charge: -0.127214 -0.129231 -0.408878 -0.401570 0.619007 0.601961 -0.292777 -0.335519 -0.295012 -0.334899 -0.129630 0.008328 0.020676 0.024864 0.025172 -0.228370 -0.241489 -0.225399 -0.244899 0.157651 0.156715 0.096812 0.096791 0.092326 0.094536 0.093771 0.091919 0.090021 0.095872 0.089772 0.083061 0.078403 0.085602 0.087118 0.089623 0.087346 0.079761 0.083337 0.086735 0.087531 0.090176
qa: -0.1272 -0.1292 -0.4089 -0.4016 0.6190 0.6020 -0.2928 -0.3355 -0.2950 -0.3349 -0.1296 0.0083 0.0207 0.0249 0.0252 -0.2284 -0.2415 -0.2254 -0.2449 0.1577 0.1567 0.0968 0.0968 0.0923 0.0945 0.0938 0.0919 0.0900 0.0959 0.0898 0.0831 0.0784 0.0856 0.0871 0.0896 0.0873 0.0798 0.0833 0.0867 0.0875 0.0902
va: 2.3019 2.2989 2.0358 2.0348 5.4324 5.4268 2.1339 2.1191 2.1186 2.1002 3.9104 3.8704 3.8985 3.8649 3.8905 3.9404 3.8877 3.9271 3.8972 1.0216 1.0233 0.9922 1.0125 1.0130 0.9904 1.0148 0.9942 1.0122 0.9903 1.0113 1.0168 1.0061 1.0198 1.0141 1.0043 1.0056 1.0211 1.0106 1.0196 1.0139 1.0043
dispcorr: -0.023705506 hartree
energy: -2932.926587614091
dipole: 4.46728 -4.37762 0.08966 2.41712 -2.39042 0.02670 -10.16773 9.41400 -0.75372
magnitude: 0.75950 au
magnitude: 1.93050 debye
