program: Orca
programVersion: 5.0.2
elementType: S S S S P P O O O O C C C C C C C C C H H H H H H H H H H H H H H H H H H H H H H
charge: 0
multiplicity: 1
keywords: wb97x-d3
keywords: def2-TZVPP
keywords: def2/J RIJCOSX
keywords: DEFGRID2
keywords: scfconv7
keywords: smallprint printgap noloewdin
keywords: NOSOSCF
formula: C9H22O4P2S4
InChI: InChI=1/C9H22O4P2S4/c1-5-10-14(16,11-6-2)18-9-19-15(17,12-7-3)13-8-4/h5-9H2,1-4H3
41 atoms
S  -0.350511 -1.091502 1.456889
S  0.405993 1.764156 0.549908
S  -3.280001 0.544279 0.831371
S  3.310918 0.165389 1.315125
P  -2.108043 -0.895737 0.32523
P  2.1669 0.826993 -0.081544
O  -1.676061 -0.927772 -1.214643
O  -2.609152 -2.397652 0.541187
O  1.62715 -0.228225 -1.150273
O  2.771474 1.958234 -1.040974
C  -0.054137 0.637584 1.895581
C  -1.654984 0.230207 -2.062154
C  -3.992547 -2.757729 0.444876
C  2.194799 -1.535864 -1.303023
C  3.777138 2.880694 -0.601994
C  -2.885938 0.27335 -2.936742
C  -4.510633 -2.740754 -0.975638
C  3.501594 -1.500811 -2.061711
C  3.232217 3.961963 0.30389
H  -0.951093 1.064746 2.344013
H  0.746305 0.614251 2.6348
H  -1.575614 1.140334 -1.466565
H  -0.744952 0.146019 -2.654436
H  -4.045188 -3.761485 0.86438
H  -4.584671 -2.094709 1.080484
H  2.323544 -1.994138 -0.3206
H  1.43625 -2.1034 -1.840051
H  4.581356 2.332666 -0.105684
H  4.177018 3.309884 -1.520107
H  -3.000586 -0.643736 -3.514597
H  -3.784061 0.429037 -2.339775
H  -2.805281 1.10407 -3.638742
H  -4.566128 -1.728223 -1.372998
H  -3.883803 -3.338565 -1.636006
H  -5.518212 -3.157065 -0.996295
H  3.850885 -2.519104 -2.235441
H  3.388587 -1.013078 -3.029539
H  4.273973 -0.979947 -1.49588
H  4.018234 4.690315 0.505561
H  2.396347 4.487976 -0.156398
H  2.900655 3.558539 1.259884
totalener: -2932.90245136 hartree
nucrepener: 2766.22781051 hartree
electener: -5699.13026187 hartree
oneelecener: -9554.75143957 hartree
twoeener: 3855.62117770 hartree
kineticenergy: 2925.81889542 hartree
xcener: -173.644880401401 hartree
chargesum: -0.0000000
charge: -0.115311 -0.137363 -0.406170 -0.398331 0.612637 0.607505 -0.306201 -0.325305 -0.309967 -0.332562 -0.141973 0.046555 0.015953 0.030645 0.025485 -0.261368 -0.236738 -0.226802 -0.244462 0.158336 0.160239 0.089124 0.092744 0.094430 0.092031 0.093669 0.093886 0.090468 0.095384 0.090215 0.083917 0.091837 0.081577 0.091084 0.088456 0.083617 0.086526 0.080862 0.087873 0.089791 0.087708
qa: -0.1153 -0.1374 -0.4062 -0.3983 0.6126 0.6075 -0.3062 -0.3253 -0.3100 -0.3326 -0.1420 0.0466 0.0160 0.0306 0.0255 -0.2614 -0.2367 -0.2268 -0.2445 0.1583 0.1602 0.0891 0.0927 0.0944 0.0920 0.0937 0.0939 0.0905 0.0954 0.0902 0.0839 0.0918 0.0816 0.0911 0.0885 0.0836 0.0865 0.0809 0.0879 0.0898 0.0877
va: 2.3170 2.2950 2.0259 2.0356 5.4198 5.4282 2.0869 2.1372 2.1053 2.1127 3.9135 3.8301 3.9131 3.8622 3.8912 3.9566 3.8937 3.9253 3.8946 1.0223 1.0214 1.0128 0.9997 0.9908 1.0085 1.0147 0.9926 1.0136 0.9904 1.0006 1.0123 1.0141 1.0104 1.0071 1.0130 1.0104 1.0061 1.0226 1.0140 1.0040 1.0182
dispcorr: -0.023786489 hartree
energy: -2932.926237850828
dipole: -1.35081 1.42995 0.07914 -0.89806 0.80024 -0.09782 -18.18622 17.12271 -1.06351
magnitude: 1.07092 au
magnitude: 2.72207 debye
