program: Orca
programVersion: 5.0.2
elementType: S S S S P P O O O O C C C C C C C C C H H H H H H H H H H H H H H H H H H H H H H
charge: 0
multiplicity: 1
keywords: wb97x-d3
keywords: def2-TZVPP
keywords: def2/J RIJCOSX
keywords: DEFGRID2
keywords: scfconv7
keywords: smallprint printgap noloewdin
keywords: NOSOSCF
formula: C9H22O4P2S4
InChI: InChI=1/C9H22O4P2S4/c1-5-10-14(16,11-6-2)18-9-19-15(17,12-7-3)13-8-4/h5-9H2,1-4H3
41 atoms
S  -0.99376 1.037691 1.200664
S  0.817675 -1.417238 0.915215
S  -3.02278 -1.685588 0.927164
S  2.823551 1.289843 1.28696
P  -2.33186 -0.113204 0.066508
P  2.248004 -0.107085 0.099546
O  -3.380942 1.021405 -0.351942
O  -1.576648 -0.306063 -1.320836
O  3.319495 -1.188792 -0.3935
O  1.685045 0.338714 -1.322276
C  -0.077909 -0.295158 2.01693
C  -4.359703 1.48725 0.584782
C  -1.449542 -1.572573 -1.98174
C  4.201471 -1.807751 0.555646
C  1.429912 1.714845 -1.64732
C  -5.244572 2.48723 -0.118017
C  -2.669147 -1.884606 -2.815836
C  5.56821 -1.16603 0.515134
C  0.847264 1.765733 -3.037608
H  0.620738 0.193313 2.695643
H  -0.767654 -0.920164 2.583871
H  -4.940423 0.639235 0.956002
H  -3.858884 1.947865 1.441646
H  -0.554392 -1.476681 -2.594655
H  -1.267244 -2.356926 -1.245234
H  3.781235 -1.758267 1.564233
H  4.249593 -2.860093 0.275227
H  0.736681 2.141402 -0.920754
H  2.363854 2.277162 -1.589111
H  -4.67289 3.341253 -0.479496
H  -5.760504 2.03388 -0.963651
H  -5.99816 2.857069 0.577025
H  -2.867529 -1.099183 -3.544576
H  -2.511771 -2.816683 -3.359295
H  -3.551728 -2.011285 -2.189417
H  5.9994 -1.217237 -0.483997
H  5.519513 -0.122406 0.821957
H  6.237959 -1.689411 1.198229
H  0.676341 2.806078 -3.315063
H  1.522746 1.329853 -3.773284
H  -0.108243 1.245518 -3.082584
totalener: -2932.90563512 hartree
nucrepener: 2757.65978001 hartree
electener: -5690.56541513 hartree
oneelecener: -9537.49297380 hartree
twoeener: 3846.92755867 hartree
kineticenergy: 2925.82218002 hartree
xcener: -173.642166044407 hartree
chargesum: -0.0000000
charge: -0.147769 -0.147141 -0.395811 -0.402424 0.613818 0.621512 -0.321911 -0.309197 -0.325294 -0.304185 -0.125610 0.015391 0.029028 0.025187 0.009352 -0.227092 -0.223366 -0.227121 -0.235503 0.156124 0.158844 0.095935 0.087289 0.095646 0.096969 0.079783 0.097055 0.104720 0.107523 0.084665 0.085620 0.076392 0.085831 0.081762 0.082093 0.084964 0.085694 0.078633 0.081493 0.086963 0.084138
qa: -0.1478 -0.1471 -0.3958 -0.4024 0.6138 0.6215 -0.3219 -0.3092 -0.3253 -0.3042 -0.1256 0.0154 0.0290 0.0252 0.0094 -0.2271 -0.2234 -0.2271 -0.2355 0.1561 0.1588 0.0959 0.0873 0.0956 0.0970 0.0798 0.0971 0.1047 0.1075 0.0847 0.0856 0.0764 0.0858 0.0818 0.0821 0.0850 0.0857 0.0786 0.0815 0.0870 0.0841
va: 2.3010 2.2954 2.0410 2.0349 5.4411 5.4434 2.1339 2.1031 2.1280 2.1205 3.9007 3.8789 3.8349 3.8950 3.8338 3.9586 3.9409 3.9363 3.9486 1.0235 1.0229 1.0048 0.9959 0.9944 1.0159 1.0112 0.9922 0.9983 1.0071 1.0059 1.0067 1.0079 1.0054 1.0102 1.0221 1.0048 1.0212 1.0101 1.0102 1.0043 1.0126
dispcorr: -0.022651851 hartree
energy: -2932.928286971906
dipole: -2.78401 2.67325 -0.11076 3.65169 -3.54942 0.10226 -14.94390 14.43903 -0.50487
magnitude: 0.52689 au
magnitude: 1.33925 debye
