program: Orca
programVersion: 5.0.2
elementType: S S S S P P O O O O C C C C C C C C C H H H H H H H H H H H H H H H H H H H H H H
charge: 0
multiplicity: 1
keywords: wb97x-d3
keywords: def2-TZVPP
keywords: def2/J RIJCOSX
keywords: DEFGRID2
keywords: scfconv7
keywords: smallprint printgap noloewdin
keywords: NOSOSCF
formula: C9H22O4P2S4
InChI: InChI=1/C9H22O4P2S4/c1-5-10-14(16,11-6-2)18-9-19-15(17,12-7-3)13-8-4/h5-9H2,1-4H3
41 atoms
S  -0.943052 1.244128 0.87343
S  0.909877 -1.205141 0.92906
S  -3.090401 -1.4105 0.897229
S  2.84488 1.566559 1.314605
P  -2.350086 0.050927 -0.111492
P  2.357234 0.101794 0.168582
O  -3.390331 1.159225 -0.623772
O  -1.579363 -0.308778 -1.458021
O  3.506902 -0.948054 -0.209889
O  1.811821 0.462194 -1.282935
C  -0.099518 -0.023689 1.857121
C  -4.592564 1.472464 0.090447
C  -1.961361 -1.414233 -2.291069
C  4.386618 -1.471113 0.790961
C  1.954929 1.75881 -1.878184
C  -4.344756 2.25663 1.359672
C  -0.953033 -2.530148 -2.164857
C  5.52212 -2.182388 0.096163
C  0.881662 1.918788 -2.925678
H  0.527211 0.521041 2.562976
H  -0.835868 -0.615545 2.40121
H  -5.187136 2.053945 -0.613245
H  -5.133979 0.549508 0.310521
H  -2.962287 -1.767763 -2.031432
H  -1.998512 -1.022553 -3.308186
H  4.760309 -0.654702 1.414195
H  3.832656 -2.157549 1.437935
H  1.867465 2.529396 -1.110297
H  2.951908 1.837305 -2.31835
H  -5.301884 2.563723 1.782317
H  -3.82855 1.658333 2.109457
H  -3.756636 3.154133 1.170585
H  -1.194335 -3.324928 -2.871948
H  0.054547 -2.17368 -2.377792
H  -0.962937 -2.950371 -1.1604
H  6.092943 -1.497755 -0.530233
H  6.199255 -2.600789 0.840911
H  5.160532 -3.000177 -0.526193
H  0.98574 2.894034 -3.401774
H  0.96054 1.157081 -3.70082
H  -0.109721 1.857253 -2.47986
totalener: -2932.90511831 hartree
nucrepener: 2754.44048300 hartree
electener: -5687.34560131 hartree
oneelecener: -9531.29602450 hartree
twoeener: 3843.95042319 hartree
kineticenergy: 2925.81916017 hartree
xcener: -173.640437685450 hartree
chargesum: 0.0000000
charge: -0.125323 -0.138491 -0.404217 -0.406665 0.610019 0.626820 -0.334841 -0.296558 -0.325961 -0.297380 -0.132475 0.020768 0.027500 0.018129 0.010902 -0.242936 -0.235606 -0.228309 -0.225502 0.160929 0.156822 0.095101 0.091919 0.085558 0.093021 0.093668 0.087706 0.097998 0.101368 0.087740 0.086245 0.089859 0.086792 0.087201 0.085156 0.084441 0.076207 0.085392 0.084492 0.080410 0.082102
qa: -0.1253 -0.1385 -0.4042 -0.4067 0.6100 0.6268 -0.3348 -0.2966 -0.3260 -0.2974 -0.1325 0.0208 0.0275 0.0181 0.0109 -0.2429 -0.2356 -0.2283 -0.2255 0.1609 0.1568 0.0951 0.0919 0.0856 0.0930 0.0937 0.0877 0.0980 0.1014 0.0877 0.0862 0.0899 0.0868 0.0872 0.0852 0.0844 0.0762 0.0854 0.0845 0.0804 0.0821
va: 2.3062 2.3015 2.0363 2.0401 5.4188 5.4339 2.1127 2.1202 2.1360 2.1242 3.9126 3.8964 3.8663 3.8799 3.8620 3.8895 3.9282 3.9583 3.9344 1.0218 1.0256 0.9899 1.0126 1.0159 0.9948 1.0056 0.9960 1.0102 0.9945 1.0141 1.0185 1.0043 1.0152 1.0094 1.0123 1.0075 1.0079 1.0055 1.0115 1.0055 1.0205
dispcorr: -0.022810621 hartree
energy: -2932.927928926489
dipole: 1.57911 -1.68809 -0.10898 -1.71276 1.67193 -0.04082 -11.85078 11.13909 -0.71169
magnitude: 0.72114 au
magnitude: 1.83300 debye
