program: Orca
programVersion: 5.0.2
elementType: S S S S P P O O O O C C C C C C C C C H H H H H H H H H H H H H H H H H H H H H H
charge: 0
multiplicity: 1
keywords: wb97x-d3
keywords: def2-TZVPP
keywords: def2/J RIJCOSX
keywords: DEFGRID2
keywords: scfconv7
keywords: smallprint printgap noloewdin
keywords: NOSOSCF
formula: C9H22O4P2S4
InChI: InChI=1/C9H22O4P2S4/c1-5-10-14(16,11-6-2)18-9-19-15(17,12-7-3)13-8-4/h5-9H2,1-4H3
41 atoms
S  -0.800438 -1.432276 -0.182671
S  0.390571 1.046068 1.17925
S  -3.486347 -0.244577 1.520126
S  3.273247 -0.742063 0.912029
P  -2.819063 -0.79957 -0.195691
P  2.236546 0.737897 0.248461
O  -2.952933 0.235975 -1.398227
O  -3.526888 -2.032517 -0.919972
O  1.871817 0.710903 -1.30449
O  2.865175 2.202239 0.401227
C  -0.173081 -0.670582 1.332124
C  -2.52286 1.599125 -1.261387
C  -4.209041 -3.053956 -0.182204
C  2.650139 -0.021652 -2.262031
C  3.587517 2.576724 1.584246
C  -1.453843 1.90714 -2.28045
C  -3.271179 -3.989152 0.547453
C  3.981539 0.633863 -2.546543
C  5.075309 2.549285 1.325318
H  -0.954615 -0.669821 2.092794
H  0.657697 -1.289707 1.672565
H  -3.407456 2.219203 -1.411077
H  -2.157874 1.794446 -0.249892
H  -4.909739 -2.590679 0.516203
H  -4.787248 -3.592086 -0.932216
H  2.787802 -1.046207 -1.909972
H  2.02698 -0.05143 -3.15469
H  3.247659 3.581083 1.837185
H  3.329582 1.919878 2.419085
H  -1.80417 1.713263 -3.293868
H  -1.18252 2.961059 -2.213713
H  -0.555519 1.320801 -2.098345
H  -3.848827 -4.804953 0.983248
H  -2.52948 -4.419898 -0.124015
H  -2.748269 -3.483782 1.358662
H  4.483129 0.099421 -3.353962
H  3.858086 1.671914 -2.852972
H  4.635568 0.602204 -1.675278
H  5.343431 3.194572 0.489307
H  5.607129 2.905063 2.208285
H  5.416364 1.537008 1.112393
totalener: -2932.90421849 hartree
nucrepener: 2701.23952261 hartree
electener: -5634.14374110 hartree
oneelecener: -9424.46221854 hartree
twoeener: 3790.31847744 hartree
kineticenergy: 2925.80590637 hartree
xcener: -173.639393671731 hartree
chargesum: -0.0000000
charge: -0.137688 -0.125247 -0.399368 -0.398821 0.611145 0.595918 -0.300706 -0.319591 -0.307008 -0.327109 -0.144360 0.014228 0.025382 0.032123 0.030358 -0.199395 -0.238542 -0.223546 -0.236644 0.158018 0.158861 0.100749 0.072396 0.093726 0.095936 0.093678 0.089843 0.097904 0.087128 0.089356 0.079978 0.061228 0.088160 0.090603 0.080322 0.085317 0.090234 0.078325 0.087006 0.086010 0.084093
qa: -0.1377 -0.1252 -0.3994 -0.3988 0.6111 0.5959 -0.3007 -0.3196 -0.3070 -0.3271 -0.1444 0.0142 0.0254 0.0321 0.0304 -0.1994 -0.2385 -0.2235 -0.2366 0.1580 0.1589 0.1007 0.0724 0.0937 0.0959 0.0937 0.0898 0.0979 0.0871 0.0894 0.0800 0.0612 0.0882 0.0906 0.0803 0.0853 0.0902 0.0783 0.0870 0.0860 0.0841
va: 2.2986 2.3275 2.0457 2.0352 5.4526 5.4438 2.1380 2.1424 2.1204 2.1051 3.9025 3.8889 3.8830 3.8740 3.8749 3.9305 3.8894 3.9071 3.9269 1.0352 1.0326 0.9983 1.0182 1.0121 0.9913 1.0150 0.9914 0.9935 1.0111 1.0093 1.0117 1.0252 1.0136 1.0059 1.0180 1.0118 1.0070 1.0187 1.0028 1.0131 1.0178
dispcorr: -0.022716946 hartree
energy: -2932.926935438156
dipole: 12.70071 -12.08773 0.61298 3.75883 -3.49037 0.26846 -8.55714 8.04546 -0.51168
magnitude: 0.84239 au
magnitude: 2.14120 debye
