program: Orca
programVersion: 5.0.2
elementType: S S S S P P O O O O C C C C C C C C C H H H H H H H H H H H H H H H H H H H H H H
charge: 0
multiplicity: 1
keywords: wb97x-d3
keywords: def2-TZVPP
keywords: def2/J RIJCOSX
keywords: DEFGRID2
keywords: scfconv7
keywords: smallprint printgap noloewdin
keywords: NOSOSCF
formula: C9H22O4P2S4
InChI: InChI=1/C9H22O4P2S4/c1-5-10-14(16,11-6-2)18-9-19-15(17,12-7-3)13-8-4/h5-9H2,1-4H3
41 atoms
S  -0.306122 -1.814392 0.543047
S  0.417929 0.996875 1.581652
S  -3.192669 -0.28182 1.493016
S  3.480144 -0.399509 0.975911
P  -2.107176 -0.878653 0.021421
P  2.143024 0.85829 0.405281
O  -1.64325 0.217858 -1.037401
O  -2.732235 -1.987548 -0.949994
O  1.634167 0.676877 -1.101881
O  2.500924 2.416642 0.479936
C  0.168254 -0.758863 1.940071
C  -2.148492 1.559158 -1.055162
C  -3.702434 -2.94153 -0.498513
C  2.014657 -0.42888 -1.932529
C  3.848779 2.881675 0.341627
C  -3.497654 1.643596 -1.731179
C  -3.100339 -4.041162 0.347016
C  1.171525 -0.386167 -3.183299
C  4.389745 2.708258 -1.060249
H  -0.612693 -0.792948 2.699258
H  1.085644 -1.188326 2.34373
H  -2.196791 1.946452 -0.035877
H  -1.394145 2.129751 -1.59468
H  -4.49305 -2.424112 0.049706
H  -4.135017 -3.347816 -1.412153
H  3.078191 -0.351584 -2.170503
H  1.864004 -1.366924 -1.397039
H  3.807825 3.93509 0.615371
H  4.485076 2.367694 1.065976
H  -3.464822 1.237443 -2.741849
H  -4.258063 1.107914 -1.16299
H  -3.808555 2.686957 -1.796589
H  -2.735257 -3.662794 1.300989
H  -3.864376 -4.790188 0.557124
H  -2.275654 -4.535817 -0.165229
H  1.45842 -1.20775 -3.839824
H  0.114493 -0.492175 -2.946817
H  1.31386 0.545292 -3.731008
H  4.525269 1.655487 -1.308902
H  3.732772 3.162284 -1.801074
H  5.365991 3.188209 -1.133758
totalener: -2932.90237780 hartree
nucrepener: 2776.98150614 hartree
electener: -5709.88388395 hartree
oneelecener: -9576.25205366 hartree
twoeener: 3866.36816971 hartree
kineticenergy: 2925.82356120 hartree
xcener: -173.644686013997 hartree
chargesum: 0.0000000
charge: -0.143654 -0.112556 -0.395704 -0.402878 0.611961 0.609073 -0.308075 -0.334211 -0.302175 -0.328396 -0.143726 0.030961 0.024035 0.002756 0.017958 -0.227547 -0.243132 -0.227657 -0.235011 0.158930 0.159686 0.093131 0.096155 0.090473 0.095234 0.102543 0.104327 0.094948 0.094801 0.086914 0.081299 0.082205 0.086864 0.087886 0.089135 0.082299 0.086277 0.080836 0.074405 0.092094 0.087534
qa: -0.1437 -0.1126 -0.3957 -0.4029 0.6120 0.6091 -0.3081 -0.3342 -0.3022 -0.3284 -0.1437 0.0310 0.0240 0.0028 0.0180 -0.2275 -0.2431 -0.2277 -0.2350 0.1589 0.1597 0.0931 0.0962 0.0905 0.0952 0.1025 0.1043 0.0949 0.0948 0.0869 0.0813 0.0822 0.0869 0.0879 0.0891 0.0823 0.0863 0.0808 0.0744 0.0921 0.0875
va: 2.2894 2.3223 2.0378 2.0296 5.4171 5.4187 2.1088 2.1132 2.0781 2.1265 3.9148 3.8546 3.8961 3.8503 3.9038 3.9363 3.8924 3.9360 3.8886 1.0218 1.0216 1.0136 0.9934 1.0132 0.9901 0.9975 1.0019 0.9914 1.0094 1.0054 1.0218 1.0103 1.0183 1.0141 1.0042 1.0101 1.0235 1.0053 1.0198 1.0061 1.0125
dispcorr: -0.023828086 hartree
energy: -2932.926205890459
dipole: -2.17606 2.06686 -0.10920 1.11132 -0.98729 0.12403 -18.88501 17.78619 -1.09882
magnitude: 1.11118 au
magnitude: 2.82439 debye
