program: Orca
programVersion: 5.0.2
elementType: S S S S P P O O O O C C C C C C C C C H H H H H H H H H H H H H H H H H H H H H H
charge: 0
multiplicity: 1
keywords: wb97x-d3
keywords: def2-TZVPP
keywords: def2/J RIJCOSX
keywords: DEFGRID2
keywords: scfconv7
keywords: smallprint printgap noloewdin
keywords: NOSOSCF
formula: C9H22O4P2S4
InChI: InChI=1/C9H22O4P2S4/c1-5-10-14(16,11-6-2)18-9-19-15(17,12-7-3)13-8-4/h5-9H2,1-4H3
41 atoms
S  -0.446955 -1.442279 0.663097
S  0.646045 1.42579 0.525438
S  -3.279627 0.252056 1.504189
S  3.460834 -0.423277 0.869121
P  -2.322229 -0.691851 0.130678
P  2.545957 0.880711 -0.208853
O  -1.991019 0.126993 -1.200366
O  -3.014115 -2.008102 -0.462598
O  2.374809 0.601727 -1.765475
O  3.214276 2.321567 -0.364892
C  0.20279 0.002318 1.547711
C  -2.817933 1.20996 -1.649423
C  -3.886649 -2.84065 0.312707
C  1.519935 -0.409589 -2.313048
C  3.820656 2.973566 0.757512
C  -4.157596 0.741832 -2.171043
C  -3.145003 -3.69627 1.314398
C  2.110508 -1.798791 -2.226218
C  5.325976 2.891492 0.667229
H  -0.544898 0.35306 2.259468
H  1.082673 -0.346372 2.089087
H  -2.946607 1.927494 -0.83641
H  -2.236394 1.690223 -2.435001
H  -4.632006 -2.218638 0.813774
H  -4.400418 -3.460384 -0.421339
H  0.540601 -0.3697 -1.831935
H  1.385114 -0.115902 -3.353735
H  3.476972 4.007585 0.723672
H  3.467066 2.539929 1.69685
H  -4.692157 1.586757 -2.605793
H  -4.042677 -0.018137 -2.943142
H  -4.779401 0.337084 -1.372802
H  -2.363215 -4.286578 0.837383
H  -2.690828 -3.095214 2.10139
H  -3.845728 -4.385423 1.786462
H  1.474041 -2.487811 -2.782115
H  3.108065 -1.834155 -2.662066
H  2.171874 -2.15393 -1.199944
H  5.774769 3.4574 1.484025
H  5.665436 1.859526 0.742397
H  5.687817 3.310396 -0.271047
totalener: -2932.90376844 hartree
nucrepener: 2719.19807838 hartree
electener: -5652.10184682 hartree
oneelecener: -9460.40338137 hartree
twoeener: 3808.30153455 hartree
kineticenergy: 2925.82703449 hartree
xcener: -173.645791950585 hartree
chargesum: 0.0000000
charge: -0.128240 -0.143812 -0.394900 -0.399873 0.597389 0.613338 -0.304913 -0.329833 -0.296918 -0.315959 -0.134515 0.021694 0.029504 0.038400 0.027945 -0.225386 -0.246769 -0.227917 -0.222082 0.156702 0.159561 0.093927 0.091293 0.090805 0.097331 0.056701 0.095959 0.096387 0.075200 0.085511 0.089443 0.080193 0.091094 0.088934 0.088907 0.084142 0.095968 0.075841 0.078399 0.084842 0.085709
qa: -0.1282 -0.1438 -0.3949 -0.3999 0.5974 0.6133 -0.3049 -0.3298 -0.2969 -0.3160 -0.1345 0.0217 0.0295 0.0384 0.0279 -0.2254 -0.2468 -0.2279 -0.2221 0.1567 0.1596 0.0939 0.0913 0.0908 0.0973 0.0567 0.0960 0.0964 0.0752 0.0855 0.0894 0.0802 0.0911 0.0889 0.0889 0.0841 0.0960 0.0758 0.0784 0.0848 0.0857
va: 2.3150 2.3117 2.0470 2.0416 5.4328 5.4679 2.1160 2.1085 2.1540 2.1358 3.9005 3.8852 3.8721 3.8994 3.8863 3.9029 3.9030 3.8913 3.9389 1.0320 1.0318 1.0144 0.9916 1.0137 0.9900 1.0268 0.9953 0.9928 1.0153 1.0111 1.0069 1.0216 1.0037 1.0172 1.0141 1.0101 1.0095 1.0265 1.0100 1.0189 1.0056
dispcorr: -0.022628373 hartree
energy: -2932.926396814084
dipole: -3.95948 3.16018 -0.79930 -3.70241 3.67842 -0.02399 -7.65061 7.10566 -0.54495
magnitude: 0.96769 au
magnitude: 2.45967 debye
