program: Orca
programVersion: 5.0.3
elementType: S O O N C C C C C C C C C C C H H H H H H H H H H H H H H H
charge: 0
multiplicity: 1
keywords: wb97x-d3
keywords: def2-TZVPP
keywords: def2/J RIJCOSX
keywords: DEFGRID2
keywords: scfconv7
keywords: smallprint printgap noloewdin
keywords: NOSOSCF
formula: C11H15NO2S
InChI: InChI=1/C11H15NO2S/c1-3-15-8-9-6-4-5-7-10(9)14-11(13)12-2/h4-7,12H,3,8H2,1-2H3
30 atoms
S  -0.047226 2.413694 -0.07598
O  1.047422 -0.708869 -0.721748
O  1.784544 -1.902339 1.052832
N  3.229404 -0.885761 -0.369723
C  -0.931714 -0.144754 0.505847
C  -0.272134 1.054465 1.111039
C  -0.262028 -0.988651 -0.376357
C  -2.266971 -0.430478 0.777898
C  -0.881001 -2.077901 -0.961183
C  -2.906519 -1.517426 0.197869
C  -1.774735 2.903103 -0.336693
C  -2.213514 -2.341948 -0.675359
C  -1.827901 4.088456 -1.281928
C  2.019339 -1.224559 0.071647
C  4.422198 -1.257495 0.357746
H  -0.86199 1.417779 1.954059
H  0.721303 0.830159 1.501989
H  -2.809324 0.212982 1.46001
H  -0.325429 -2.711523 -1.64104
H  -2.334126 2.063172 -0.751592
H  -2.222585 3.158333 0.625401
H  -3.945118 -1.715689 0.426651
H  -2.702229 -3.191587 -1.132873
H  -1.396177 3.847173 -2.253552
H  -2.863829 4.386132 -1.445214
H  -1.294573 4.949484 -0.878745
H  3.310517 -0.268219 -1.161722
H  4.516987 -2.339278 0.448846
H  4.4461 -0.820401 1.356882
H  5.283865 -0.890655 -0.192587
elementType: S O N C H
totalener: -1031.70909424 hartree
nucrepener: 1116.22596580 hartree
electener: -2147.93506004 hartree
oneelecener: -3628.85941359 hartree
twoeener: 1480.92435355 hartree
cpcmener: -0.03279707 hartree
kineticenergy: 1028.21775115 hartree
xcener: -80.623194681844 hartree
chargesum: 0.0000000
charge: -0.172719 -0.331456 -0.549636 -0.217672 0.016915 -0.110833 0.148774 -0.183673 -0.152710 -0.138121 -0.110738 -0.168259 -0.256058 0.517813 -0.164605 0.130881 0.131139 0.146799 0.153418 0.095379 0.094383 0.161663 0.161454 0.087061 0.095329 0.087992 0.187955 0.110418 0.113223 0.115884
qa: -0.1727 -0.3315 -0.5496 -0.2177 0.0169 -0.1108 0.1488 -0.1837 -0.1527 -0.1381 -0.1107 -0.1683 -0.2561 0.5178 -0.1646 0.1309 0.1311 0.1468 0.1534 0.0954 0.0944 0.1617 0.1615 0.0871 0.0953 0.0880 0.1880 0.1104 0.1132 0.1159
va: 2.1624 2.0791 1.9511 3.2104 3.5718 3.9114 3.7866 3.8856 3.9895 3.8785 3.9972 3.9085 3.9260 4.2590 3.9013 1.0094 1.0074 1.0002 0.9967 0.9990 1.0005 0.9884 0.9882 1.0072 1.0020 1.0079 1.0066 0.9916 0.9898 0.9977
dispcorr: -0.012300699 hartree
energy: -1031.721394933928
dipole: -2.49472 2.45092 -0.04379 7.70445 -6.99581 0.70865 -0.86606 0.13605 -0.73001
magnitude: 1.01834 au
magnitude: 2.58841 debye
