program: Orca
programVersion: 5.0.3
elementType: S O O N C C C C C C C C C C C H H H H H H H H H H H H H H H
charge: 0
multiplicity: 1
keywords: wb97x-d3
keywords: def2-TZVPP
keywords: def2/J RIJCOSX
keywords: DEFGRID2
keywords: scfconv7
keywords: smallprint printgap noloewdin
keywords: NOSOSCF
formula: C11H15NO2S
InChI: InChI=1/C11H15NO2S/c1-3-15-8-9-6-4-5-7-10(9)14-11(13)12-2/h4-7,12H,3,8H2,1-2H3
30 atoms
S  -1.512127 2.469213 -0.414761
O  0.929113 -0.446765 0.581258
O  1.78491 -1.863422 -0.956173
N  3.092866 -0.3510 0.124832
C  -1.224953 -0.291888 -0.449346
C  -0.855057 0.958291 -1.189782
C  -0.337774 -0.962063 0.38498
C  -2.514665 -0.813111 -0.563022
C  -0.701564 -2.107646 1.077213
C  -2.895175 -1.956738 0.117836
C  -0.528225 2.569458 1.105879
C  -1.986213 -2.606181 0.944817
C  0.914414 2.980967 0.885775
C  1.940306 -0.958629 -0.161154
C  4.304837 -0.650384 -0.602124
H  0.219006 1.058992 -1.341042
H  -1.306305 0.942831 -2.182962
H  -3.226723 -0.308504 -1.20513
H  0.017428 -2.596839 1.722295
H  -1.0422 3.309364 1.72181
H  -0.601178 1.622936 1.643867
H  -3.900639 -2.340452 0.007076
H  -2.274811 -3.498807 1.483491
H  1.437875 2.307753 0.207145
H  0.97486 3.985868 0.468818
H  1.455507 2.976478 1.833658
H  3.070881 0.477368 0.700123
H  4.467658 -1.722832 -0.662401
H  5.142867 -0.216459 -0.066408
H  4.295275 -0.240706 -1.612231
elementType: S O N C H
totalener: -1031.70913408 hartree
nucrepener: 1131.86524312 hartree
electener: -2163.57437720 hartree
oneelecener: -3659.55896774 hartree
twoeener: 1495.98459054 hartree
cpcmener: -0.03326278 hartree
kineticenergy: 1028.21994753 hartree
xcener: -80.623958811802 hartree
chargesum: 0.0000000
charge: -0.183699 -0.342808 -0.547597 -0.225540 0.061415 -0.149568 0.186704 -0.208921 -0.156087 -0.150223 -0.106746 -0.168571 -0.256690 0.514428 -0.160507 0.126953 0.142935 0.140837 0.157415 0.116973 0.096830 0.162150 0.162201 0.066495 0.086853 0.099188 0.197518 0.106435 0.115435 0.116189
qa: -0.1837 -0.3428 -0.5476 -0.2255 0.0614 -0.1496 0.1867 -0.2089 -0.1561 -0.1502 -0.1067 -0.1686 -0.2567 0.5144 -0.1605 0.1270 0.1429 0.1408 0.1574 0.1170 0.0968 0.1622 0.1622 0.0665 0.0869 0.0992 0.1975 0.1064 0.1154 0.1162
va: 2.1364 2.0499 1.9556 3.2192 3.5604 3.8998 3.6624 3.9823 3.9891 3.8842 3.9276 3.9130 3.9186 4.2651 3.9002 1.0097 0.9968 1.0059 0.9952 1.0021 1.0144 0.9883 0.9880 1.0123 1.0151 1.0038 0.9960 0.9981 0.9976 0.9882
dispcorr: -0.013802121 hartree
energy: -1031.722936196898
dipole: 8.26499 -6.99277 1.27221 5.48148 -4.65705 0.82443 2.31834 -1.26804 1.05030
magnitude: 1.84427 au
magnitude: 4.68777 debye
