program: Orca
programVersion: 5.0.3
elementType: S O O N C C C C C C C C C C C H H H H H H H H H H H H H H H
charge: 0
multiplicity: 1
keywords: wb97x-d3
keywords: def2-TZVPP
keywords: def2/J RIJCOSX
keywords: DEFGRID2
keywords: scfconv7
keywords: smallprint printgap noloewdin
keywords: NOSOSCF
formula: C11H15NO2S
InChI: InChI=1/C11H15NO2S/c1-3-15-8-9-6-4-5-7-10(9)14-11(13)12-2/h4-7,12H,3,8H2,1-2H3
30 atoms
S  0.325478 2.050989 -0.318338
O  0.768626 -1.140493 -0.996898
O  1.761584 -1.007253 1.035475
N  2.949647 -0.775217 -0.884012
C  -1.345923 -0.161827 -0.535474
C  -0.936592 1.101652 -1.225667
C  -0.478715 -1.2442 -0.415232
C  -2.618771 -0.292098 0.014017
C  -0.853989 -2.418842 0.212114
C  -3.010434 -1.459185 0.655227
C  -0.541965 2.386642 1.23886
C  -2.128729 -2.525665 0.750333
C  -1.726487 3.320935 1.10006
C  1.834962 -0.958676 -0.175502
C  4.207896 -0.480303 -0.239678
H  -0.490858 0.900456 -2.201167
H  -1.809942 1.729048 -1.402792
H  -3.311451 0.536912 -0.066807
H  -0.160936 -3.248644 0.268912
H  -0.836346 1.439475 1.694618
H  0.215535 2.823343 1.891893
H  -4.005172 -1.536257 1.07339
H  -2.427349 -3.441494 1.242642
H  -2.180957 3.496863 2.07671
H  -1.424663 4.284756 0.690966
H  -2.499928 2.906839 0.452882
H  2.875383 -0.641788 -1.880253
H  4.222402 0.516934 0.202746
H  4.994958 -0.533534 -0.985951
H  4.432615 -1.209154 0.536208
elementType: S O N C H
totalener: -1031.70982155 hartree
nucrepener: 1145.56466070 hartree
electener: -2177.27448225 hartree
oneelecener: -3687.81527028 hartree
twoeener: 1510.54078803 hartree
cpcmener: -0.03269269 hartree
kineticenergy: 1028.22445032 hartree
xcener: -80.627162162156 hartree
chargesum: 0.0000000
charge: -0.178405 -0.339456 -0.543879 -0.209002 -0.018950 -0.127244 0.198132 -0.151277 -0.175189 -0.164490 -0.105784 -0.154220 -0.253191 0.491172 -0.157820 0.139192 0.125831 0.153132 0.153881 0.096265 0.117939 0.161349 0.162640 0.096772 0.081287 0.079243 0.188171 0.111265 0.115657 0.106979
qa: -0.1784 -0.3395 -0.5439 -0.2090 -0.0190 -0.1272 0.1981 -0.1513 -0.1752 -0.1645 -0.1058 -0.1542 -0.2532 0.4912 -0.1578 0.1392 0.1258 0.1531 0.1539 0.0963 0.1179 0.1613 0.1626 0.0968 0.0813 0.0792 0.1882 0.1113 0.1157 0.1070
va: 2.1612 2.0708 1.9511 3.1990 3.5771 3.9000 3.7791 3.8856 3.9908 3.9149 3.9437 3.8934 3.9261 4.3027 3.8980 1.0033 1.0021 0.9927 0.9981 1.0112 0.9995 0.9895 0.9876 1.0044 1.0143 1.0043 1.0052 0.9913 0.9977 0.9963
dispcorr: -0.013617600 hartree
energy: -1031.723439152216
dipole: -2.12225 1.82945 -0.29280 7.69389 -7.44186 0.25203 3.48823 -4.62369 -1.13546
magnitude: 1.19938 au
magnitude: 3.04858 debye
