program: Orca
programVersion: 5.0.3
elementType: S O O N C C C C C C C C C C C H H H H H H H H H H H H H H H
charge: 0
multiplicity: 1
keywords: wb97x-d3
keywords: def2-TZVPP
keywords: def2/J RIJCOSX
keywords: DEFGRID2
keywords: scfconv7
keywords: smallprint printgap noloewdin
keywords: NOSOSCF
formula: C11H15NO2S
InChI: InChI=1/C11H15NO2S/c1-3-15-8-9-6-4-5-7-10(9)14-11(13)12-2/h4-7,12H,3,8H2,1-2H3
30 atoms
S  0.366173 2.048839 0.424869
O  0.853148 -1.167212 0.871294
O  1.625426 -0.864352 -1.237162
N  3.012731 -0.786848 0.555552
C  -1.29826 -0.174308 0.668357
C  -0.829377 1.058432 1.376908
C  -0.446164 -1.244908 0.411191
C  -2.618461 -0.284801 0.239475
C  -0.881725 -2.38985 -0.232224
C  -3.071009 -1.421062 -0.416508
C  -0.561718 2.353789 -1.10327
C  -2.202894 -2.477541 -0.648099
C  -1.779698 3.236645 -0.924086
C  1.82772 -0.918429 -0.041068
C  4.194618 -0.432568 -0.195206
H  -1.685095 1.6765 1.648513
H  -0.311802 0.813225 2.305998
H  -3.299733 0.536631 0.424907
H  -0.198077 -3.213091 -0.396704
H  0.157244 2.824977 -1.775543
H  -0.828772 1.396576 -1.554677
H  -4.101617 -1.481683 -0.739801
H  -2.547652 -3.370866 -1.151559
H  -2.270688 3.397467 -1.885533
H  -2.514248 2.787558 -0.25517
H  -1.506347 4.210658 -0.519053
H  3.051748 -0.742652 1.561576
H  5.050696 -0.49298 0.470199
H  4.143013 0.58161 -0.594261
H  4.361542 -1.123553 -1.01931
elementType: S O N C H
totalener: -1031.70956078 hartree
nucrepener: 1149.21239033 hartree
electener: -2180.92195111 hartree
oneelecener: -3695.11879928 hartree
twoeener: 1514.19684817 hartree
cpcmener: -0.03206874 hartree
kineticenergy: 1028.22331205 hartree
xcener: -80.627109484604 hartree
chargesum: 0.0000000
charge: -0.181587 -0.338345 -0.544414 -0.207913 -0.028811 -0.122473 0.200407 -0.143295 -0.173744 -0.169967 -0.100498 -0.151823 -0.254904 0.492759 -0.159464 0.122894 0.138878 0.154176 0.154051 0.118741 0.091969 0.161158 0.162434 0.096866 0.079133 0.081833 0.187839 0.115616 0.110248 0.108234
qa: -0.1816 -0.3383 -0.5444 -0.2079 -0.0288 -0.1225 0.2004 -0.1433 -0.1737 -0.1700 -0.1005 -0.1518 -0.2549 0.4928 -0.1595 0.1229 0.1389 0.1542 0.1541 0.1187 0.0920 0.1612 0.1624 0.0969 0.0791 0.0818 0.1878 0.1156 0.1102 0.1082
va: 2.1564 2.0731 1.9491 3.1999 3.5909 3.8990 3.7724 3.8824 3.9945 3.9165 3.9425 3.8902 3.9302 4.2996 3.8994 1.0036 1.0026 0.9912 0.9976 0.9991 1.0138 0.9898 0.9876 1.0045 1.0046 1.0143 1.0057 0.9978 0.9917 0.9947
dispcorr: -0.013828512 hartree
energy: -1031.723389291240
dipole: -2.23922 2.10028 -0.13894 7.37070 -7.28760 0.08310 -3.38345 4.50623 1.12277
magnitude: 1.13438 au
magnitude: 2.88338 debye
