program: Orca
programVersion: 5.0.3
elementType: S O O N C C C C C C C C C C C H H H H H H H H H H H H H H H
charge: 0
multiplicity: 1
keywords: wb97x-d3
keywords: def2-TZVPP
keywords: def2/J RIJCOSX
keywords: DEFGRID2
keywords: scfconv7
keywords: smallprint printgap noloewdin
keywords: NOSOSCF
formula: C11H15NO2S
InChI: InChI=1/C11H15NO2S/c1-3-15-8-9-6-4-5-7-10(9)14-11(13)12-2/h4-7,12H,3,8H2,1-2H3
30 atoms
S  -1.293685 2.526271 -0.397607
O  1.046727 -0.550573 0.427662
O  1.744915 -2.010736 -1.151819
N  3.185376 -0.577619 -0.142127
C  -1.13895 -0.242654 -0.489184
C  -0.724988 1.002308 -1.214332
C  -0.255662 -0.984333 0.286853
C  -2.462582 -0.678935 -0.551226
C  -0.65904 -2.121114 0.9720
C  -2.881334 -1.812946 0.122475
C  -0.359795 2.469458 1.158588
C  -1.977057 -2.536171 0.890866
C  -0.682072 3.703129 1.981583
C  1.988728 -1.126431 -0.361457
C  4.370343 -1.054224 -0.813874
H  0.351377 1.059254 -1.37371
H  -1.188057 1.026419 -2.202259
H  -3.172044 -0.114917 -1.145327
H  0.056559 -2.669438 1.572108
H  -0.627306 1.568729 1.713462
H  0.708171 2.426614 0.938694
H  -3.913158 -2.131695 0.052662
H  -2.296264 -3.421856 1.424379
H  -0.402506 4.620013 1.461601
H  -1.744237 3.760304 2.222218
H  -0.131925 3.674603 2.922834
H  3.281712 0.117142 0.581136
H  5.187549 -0.375017 -0.587578
H  4.235201 -1.069685 -1.894793
H  4.656812 -2.05473 -0.485381
elementType: S O N C H
totalener: -1031.71445223 hartree
nucrepener: 1115.40687789 hartree
electener: -2147.12133012 hartree
oneelecener: -3626.75677648 hartree
twoeener: 1479.63544635 hartree
cpcmener: -0.02704614 hartree
kineticenergy: 1028.21775847 hartree
xcener: -80.621769682239 hartree
chargesum: -0.0000000
charge: -0.169181 -0.341620 -0.511360 -0.225658 0.047597 -0.129249 0.190509 -0.206056 -0.143876 -0.146717 -0.110665 -0.168102 -0.256061 0.497925 -0.159850 0.120686 0.137314 0.136119 0.151304 0.093456 0.089735 0.158241 0.158152 0.089287 0.087889 0.093991 0.183196 0.112861 0.108002 0.112130
qa: -0.1692 -0.3416 -0.5114 -0.2257 0.0476 -0.1292 0.1905 -0.2061 -0.1439 -0.1467 -0.1107 -0.1681 -0.2561 0.4979 -0.1598 0.1207 0.1373 0.1361 0.1513 0.0935 0.0897 0.1582 0.1582 0.0893 0.0879 0.0940 0.1832 0.1129 0.1080 0.1121
va: 2.1632 2.0529 2.0018 3.1901 3.5660 3.9066 3.6952 3.9865 3.9960 3.8925 3.9926 3.9221 3.9262 4.2836 3.9030 1.0222 0.9974 1.0081 0.9967 1.0013 1.0045 0.9897 0.9895 1.0076 1.0075 1.0019 1.0078 0.9976 0.9947 0.9892
dispcorr: -0.012534592 hartree
energy: -1031.726986822305
dipole: 5.07600 -3.75699 1.31901 6.04424 -5.51408 0.53016 4.70817 -3.57220 1.13596
magnitude: 1.81969 au
magnitude: 4.62528 debye
