program: Orca
programVersion: 5.0.3
elementType: S O O N C C C C C C C C C C C H H H H H H H H H H H H H H H
charge: 0
multiplicity: 1
keywords: wb97x-d3
keywords: def2-TZVPP
keywords: def2/J RIJCOSX
keywords: DEFGRID2
keywords: scfconv7
keywords: smallprint printgap noloewdin
keywords: NOSOSCF
formula: C11H15NO2S
InChI: InChI=1/C11H15NO2S/c1-3-15-8-9-6-4-5-7-10(9)14-11(13)12-2/h4-7,12H,3,8H2,1-2H3
30 atoms
S  -1.416385 2.475187 0.401773
O  0.8703 -0.575824 -0.688117
O  1.742607 -1.55011 1.15056
N  3.036058 -0.372138 -0.309732
C  -1.192523 -0.295319 0.515392
C  -0.742283 0.972313 1.179137
C  -0.390274 -1.027426 -0.354484
C  -2.481624 -0.773515 0.752072
C  -0.840867 -2.190561 -0.960762
C  -2.947847 -1.931376 0.15381
C  -0.50552 2.520123 -1.167005
C  -2.12509 -2.643237 -0.70975
C  0.958108 2.888866 -1.02206
C  1.89363 -0.891507 0.145993
C  4.300722 -0.508214 0.369136
H  -1.119689 1.000542 2.202715
H  0.340502 1.057921 1.256397
H  -3.127349 -0.221601 1.425079
H  -0.185858 -2.730556 -1.633263
H  -0.632606 1.567922 -1.684915
H  -1.025625 3.266047 -1.770927
H  -3.952168 -2.278137 0.359545
H  -2.479387 -3.549191 -1.183752
H  1.071637 3.900228 -0.632046
H  1.48997 2.213986 -0.351567
H  1.456656 2.844763 -1.992598
H  3.015202 0.150444 -1.171897
H  4.149309 -0.882121 1.377863
H  4.791576 0.461585 0.438361
H  4.966157 -1.195359 -0.155761
elementType: S O N C H
totalener: -1031.71383746 hartree
nucrepener: 1135.06051290 hartree
electener: -2166.77435036 hartree
oneelecener: -3665.98504574 hartree
twoeener: 1499.21069538 hartree
cpcmener: -0.02645992 hartree
kineticenergy: 1028.21557856 hartree
xcener: -80.622837911266 hartree
chargesum: -0.0000000
charge: -0.176762 -0.342404 -0.507012 -0.210238 0.077768 -0.154238 0.180214 -0.207283 -0.148957 -0.144886 -0.106081 -0.168287 -0.259330 0.468945 -0.143402 0.142238 0.124816 0.136475 0.149342 0.096283 0.115604 0.158135 0.157787 0.088600 0.065553 0.097467 0.185164 0.102763 0.111419 0.110307
qa: -0.1768 -0.3424 -0.5070 -0.2102 0.0778 -0.1542 0.1802 -0.2073 -0.1490 -0.1449 -0.1061 -0.1683 -0.2593 0.4689 -0.1434 0.1422 0.1248 0.1365 0.1493 0.0963 0.1156 0.1581 0.1578 0.0886 0.0656 0.0975 0.1852 0.1028 0.1114 0.1103
va: 2.1394 2.0424 2.0082 3.2103 3.5325 3.9109 3.6947 3.9908 3.9847 3.8879 3.9251 3.9234 3.9171 4.3085 3.8847 0.9980 1.0100 1.0072 0.9986 1.0148 1.0025 0.9897 0.9893 1.0155 1.0150 1.0037 1.0032 1.0159 0.9921 0.9899
dispcorr: -0.013930723 hartree
energy: -1031.727768179235
dipole: 8.38687 -7.14301 1.24386 5.20598 -4.80672 0.39926 -3.25597 1.91067 -1.34530
magnitude: 1.87521 au
magnitude: 4.76642 debye
