program: Orca
programVersion: 5.0.3
elementType: S O O N C C C C C C C C C C C H H H H H H H H H H H H H H H
charge: 0
multiplicity: 1
keywords: wb97x-d3
keywords: def2-TZVPP
keywords: def2/J RIJCOSX
keywords: DEFGRID2
keywords: scfconv7
keywords: smallprint printgap noloewdin
keywords: NOSOSCF
formula: C11H15NO2S
InChI: InChI=1/C11H15NO2S/c1-3-15-8-9-6-4-5-7-10(9)14-11(13)12-2/h4-7,12H,3,8H2,1-2H3
30 atoms
S  -1.476793 2.459202 0.524454
O  0.850472 -0.569322 -0.752561
O  1.805892 -1.654696 0.982741
N  3.032742 -0.366443 -0.428474
C  -1.15715 -0.298806 0.534796
C  -0.66936 0.963658 1.180718
C  -0.395496 -1.027325 -0.372388
C  -2.435129 -0.776512 0.82713
C  -0.869874 -2.190637 -0.960212
C  -2.925516 -1.934045 0.248359
C  -0.823403 2.518629 -1.16759
C  -2.140442 -2.644999 -0.650931
C  0.629237 2.942551 -1.259071
C  1.907043 -0.929054 0.018507
C  4.311008 -0.650879 0.1760
H  -0.922055 0.955352 2.242684
H  0.411221 1.085178 1.126653
H  -3.051147 -0.224096 1.52689
H  -0.245316 -2.729824 -1.661601
H  -0.990084 1.551279 -1.645773
H  -1.46088 3.233219 -1.69174
H  -3.919583 -2.28243 0.49667
H  -2.515713 -3.550223 -1.110028
H  0.953689 2.941427 -2.30192
H  0.771106 3.948952 -0.865409
H  1.291946 2.272218 -0.71127
H  3.004801 0.172212 -1.280022
H  4.665947 -1.655461 -0.059966
H  4.266773 -0.545582 1.258196
H  5.036894 0.064106 -0.199905
elementType: S O N C H
totalener: -1031.71458511 hartree
nucrepener: 1131.81193465 hartree
electener: -2163.52651976 hartree
oneelecener: -3659.50584877 hartree
twoeener: 1495.97932900 hartree
cpcmener: -0.02679554 hartree
kineticenergy: 1028.21535669 hartree
xcener: -80.621716870609 hartree
chargesum: 0.0000000
charge: -0.176178 -0.340515 -0.509860 -0.223348 0.062122 -0.145598 0.186670 -0.207721 -0.146145 -0.146569 -0.109112 -0.166512 -0.246829 0.491271 -0.158390 0.142929 0.119737 0.135554 0.149609 0.097704 0.115280 0.157780 0.157601 0.095166 0.085147 0.061811 0.187227 0.112155 0.106933 0.112081
qa: -0.1762 -0.3405 -0.5099 -0.2233 0.0621 -0.1456 0.1867 -0.2077 -0.1461 -0.1466 -0.1091 -0.1665 -0.2468 0.4913 -0.1584 0.1429 0.1197 0.1356 0.1496 0.0977 0.1153 0.1578 0.1576 0.0952 0.0851 0.0618 0.1872 0.1122 0.1069 0.1121
va: 2.1402 2.0499 2.0028 3.2006 3.5478 3.9157 3.6816 3.9926 3.9908 3.8915 3.9359 3.9213 3.9179 4.2845 3.9054 0.9977 1.0133 1.0093 0.9982 1.0122 1.0019 0.9898 0.9893 1.0047 1.0153 1.0162 1.0033 0.9880 0.9968 0.9980
dispcorr: -0.013709299 hartree
energy: -1031.728294410435
dipole: 7.56320 -6.42587 1.13733 5.11693 -4.69350 0.42343 -4.11851 2.66607 -1.45245
magnitude: 1.89273 au
magnitude: 4.81093 debye
