program: Orca
programVersion: 5.0.3
elementType: S O O N C C C C C C C C C C C H H H H H H H H H H H H H H H
charge: 0
multiplicity: 1
keywords: wb97x-d3
keywords: def2-TZVPP
keywords: def2/J RIJCOSX
keywords: DEFGRID2
keywords: scfconv7
keywords: smallprint printgap noloewdin
keywords: NOSOSCF
formula: C11H15NO2S
InChI: InChI=1/C11H15NO2S/c1-3-15-8-9-6-4-5-7-10(9)14-11(13)12-2/h4-7,12H,3,8H2,1-2H3
30 atoms
S  -1.444788 2.495861 -0.462909
O  1.043252 -0.693225 0.612023
O  1.65829 -1.577937 -1.371892
N  3.157648 -0.540952 -0.003346
C  -1.094941 -0.257875 -0.400603
C  -0.617544 0.994904 -1.076023
C  -0.269037 -1.053479 0.386536
C  -2.426642 -0.651491 -0.53289
C  -0.739043 -2.195476 1.018333
C  -2.911678 -1.787823 0.09038
C  -0.920067 2.499347 1.273137
C  -2.06595 -2.56214 0.874985
C  0.541386 2.839389 1.485913
C  1.951186 -0.992521 -0.353143
C  4.334195 -0.69314 -0.822322
H  0.460248 1.131102 -1.011598
H  -0.857888 0.960018 -2.140538
H  -3.093213 -0.045642 -1.1349
H  -0.064523 -2.784833 1.626967
H  -1.556571 3.242947 1.756679
H  -1.17384 1.536617 1.722237
H  -3.949864 -2.067733 -0.031311
H  -2.436414 -3.449424 1.371216
H  0.775233 3.833688 1.105051
H  0.776803 2.824257 2.552188
H  1.206014 2.126943 0.997245
H  3.257825 -0.080989 0.888646
H  5.03292 -1.409628 -0.388303
H  4.842879 0.264303 -0.928066
H  4.058426 -1.041381 -1.81357
elementType: S O N C H
totalener: -1031.71350149 hartree
nucrepener: 1130.16125858 hartree
electener: -2161.87476008 hartree
oneelecener: -3656.24642598 hartree
twoeener: 1494.37166590 hartree
cpcmener: -0.02560127 hartree
kineticenergy: 1028.22167805 hartree
xcener: -80.624483849729 hartree
chargesum: 0.0000000
charge: -0.174872 -0.342942 -0.504937 -0.208281 0.031485 -0.139528 0.210539 -0.194690 -0.148333 -0.148787 -0.108051 -0.165202 -0.245587 0.467846 -0.142482 0.112541 0.145129 0.130190 0.147040 0.115336 0.097890 0.158067 0.157856 0.082314 0.094780 0.066700 0.181565 0.109883 0.111809 0.102723
qa: -0.1749 -0.3429 -0.5049 -0.2083 0.0315 -0.1395 0.2105 -0.1947 -0.1483 -0.1488 -0.1081 -0.1652 -0.2456 0.4678 -0.1425 0.1125 0.1451 0.1302 0.1470 0.1153 0.0979 0.1581 0.1579 0.0823 0.0948 0.0667 0.1816 0.1099 0.1118 0.1027
va: 2.1475 2.0460 2.0118 3.2048 3.5532 3.9226 3.6822 3.9690 3.9891 3.8978 3.9480 3.9184 3.9214 4.3106 3.8821 1.0189 0.9974 1.0171 0.9996 0.9990 1.0086 0.9900 0.9892 1.0147 1.0056 1.0123 1.0063 0.9902 0.9925 1.0166
dispcorr: -0.013488554 hartree
energy: -1031.726990048129
dipole: 7.06450 -5.77881 1.28569 4.94361 -4.64890 0.29471 4.23416 -2.79737 1.43678
magnitude: 1.95044 au
magnitude: 4.95761 debye
