program: Orca
programVersion: 5.0.3
elementType: S O O N C C C C C C C C C C C H H H H H H H H H H H H H H H
charge: 0
multiplicity: 1
keywords: wb97x-d3
keywords: def2-TZVPP
keywords: def2/J RIJCOSX
keywords: DEFGRID2
keywords: scfconv7
keywords: smallprint printgap noloewdin
keywords: NOSOSCF
formula: C11H15NO2S
InChI: InChI=1/C11H15NO2S/c1-3-15-8-9-6-4-5-7-10(9)14-11(13)12-2/h4-7,12H,3,8H2,1-2H3
30 atoms
S  0.107863 2.349703 0.7229
O  1.147273 -0.838992 0.519431
O  1.619393 -1.521226 -1.582863
N  3.260475 -0.931854 -0.129675
C  -0.963447 -0.014314 -0.25811
C  -0.360738 1.288111 -0.680637
C  -0.200688 -1.033176 0.308502
C  -2.333326 -0.230596 -0.382303
C  -0.767288 -2.224375 0.72386
C  -2.919504 -1.41787 0.034016
C  -1.515944 2.712394 1.446448
C  -2.135403 -2.416828 0.589554
C  -2.408436 3.581095 0.583212
C  1.993052 -1.130858 -0.498565
C  4.353196 -1.093949 -1.057641
H  0.553859 1.15382 -1.260117
H  -1.052075 1.826132 -1.329925
H  -2.947843 0.546974 -0.8205
H  -0.14134 -2.993729 1.1589
H  -2.011196 1.775094 1.708645
H  -1.291711 3.217086 2.388269
H  -3.987194 -1.558229 -0.073277
H  -2.581989 -3.345413 0.92004
H  -1.93164 4.533765 0.352732
H  -2.665746 3.096727 -0.359327
H  -3.344682 3.790717 1.104536
H  3.449216 -0.542669 0.780364
H  5.284713 -1.055654 -0.499682
H  4.374596 -0.306409 -1.813241
H  4.303555 -2.057318 -1.563008
elementType: S O N C H
totalener: -1031.71450214 hartree
nucrepener: 1123.19340863 hartree
electener: -2154.90791077 hartree
oneelecener: -3642.60649349 hartree
twoeener: 1487.69858273 hartree
cpcmener: -0.02683759 hartree
kineticenergy: 1028.22778136 hartree
xcener: -80.624595487596 hartree
chargesum: -0.0000000
charge: -0.173721 -0.327893 -0.512347 -0.223339 0.030187 -0.148619 0.166561 -0.186051 -0.151750 -0.145608 -0.115246 -0.162806 -0.250662 0.494522 -0.158999 0.134565 0.133308 0.150065 0.148152 0.099366 0.115785 0.157591 0.157744 0.081714 0.078214 0.095389 0.181451 0.112552 0.113173 0.106703
qa: -0.1737 -0.3279 -0.5123 -0.2233 0.0302 -0.1486 0.1666 -0.1861 -0.1517 -0.1456 -0.1152 -0.1628 -0.2507 0.4945 -0.1590 0.1346 0.1333 0.1501 0.1482 0.0994 0.1158 0.1576 0.1577 0.0817 0.0782 0.0954 0.1815 0.1126 0.1132 0.1067
va: 2.1468 2.0802 1.9990 3.1960 3.5497 3.9203 3.8087 3.8893 3.9943 3.9085 3.9563 3.9161 3.9162 4.2893 3.9035 1.0081 0.9990 0.9947 0.9988 1.0066 1.0001 0.9904 0.9891 1.0149 1.0043 1.0051 1.0103 0.9978 0.9884 0.9959
dispcorr: -0.012965132 hartree
energy: -1031.727467268727
dipole: -3.82380 3.88721 0.06341 6.91853 -6.54612 0.37241 -0.30788 1.19551 0.88763
magnitude: 0.96467 au
magnitude: 2.45201 debye
