program: Orca
programVersion: 5.0.3
elementType: S O O N C C C C C C C C C C C H H H H H H H H H H H H H H H
charge: 0
multiplicity: 1
keywords: wb97x-d3
keywords: def2-TZVPP
keywords: def2/J RIJCOSX
keywords: DEFGRID2
keywords: scfconv7
keywords: smallprint printgap noloewdin
keywords: NOSOSCF
formula: C11H15NO2S
InChI: InChI=1/C11H15NO2S/c1-3-15-8-9-6-4-5-7-10(9)14-11(13)12-2/h4-7,12H,3,8H2,1-2H3
30 atoms
S  0.334779 2.034506 -0.471755
O  0.742548 -1.139782 -0.966929
O  1.713556 -0.898213 1.065082
N  2.911069 -0.710941 -0.851763
C  -1.384311 -0.167634 -0.553085
C  -0.991423 1.081496 -1.280122
C  -0.505564 -1.236573 -0.395929
C  -2.660273 -0.297301 -0.01037
C  -0.875541 -2.395787 0.263569
C  -3.045827 -1.449421 0.660069
C  -0.348933 2.263135 1.191774
C  -2.153217 -2.502216 0.793778
C  -1.571108 3.157232 1.240745
C  1.794738 -0.8974 -0.143098
C  4.152555 -0.356231 -0.208428
H  -0.603448 0.856126 -2.275799
H  -1.866514 1.715784 -1.423112
H  -3.3620 0.521041 -0.11893
H  -0.17323 -3.21521 0.352491
H  -0.552291 1.28516 1.632057
H  0.467675 2.699113 1.770538
H  -4.043977 -1.52513 1.071225
H  -2.445953 -3.407059 1.310149
H  -2.399771 2.74951 0.660797
H  -1.917965 3.264204 2.270537
H  -1.349622 4.152672 0.855578
H  2.840588 -0.614762 -1.852127
H  4.100496 0.616913 0.283624
H  4.929826 -0.31261 -0.966659
H  4.445572 -1.102888 0.528847
elementType: S O N C H
totalener: -1031.71468116 hartree
nucrepener: 1152.40515313 hartree
electener: -2184.11983429 hartree
oneelecener: -3701.33280538 hartree
twoeener: 1517.21297109 hartree
cpcmener: -0.02558070 hartree
kineticenergy: 1028.23137769 hartree
xcener: -80.627344831063 hartree
chargesum: -0.0000000
charge: -0.178084 -0.336046 -0.506945 -0.210147 -0.027277 -0.122005 0.200573 -0.141217 -0.165649 -0.166711 -0.096423 -0.150408 -0.254408 0.472323 -0.157615 0.136910 0.118958 0.147544 0.148265 0.091597 0.117077 0.157292 0.158557 0.076719 0.096022 0.082252 0.180926 0.107954 0.111944 0.108021
qa: -0.1781 -0.3360 -0.5069 -0.2101 -0.0273 -0.1220 0.2006 -0.1412 -0.1656 -0.1667 -0.0964 -0.1504 -0.2544 0.4723 -0.1576 0.1369 0.1190 0.1475 0.1483 0.0916 0.1171 0.1573 0.1586 0.0767 0.0960 0.0823 0.1809 0.1080 0.1119 0.1080
va: 2.1559 2.0735 1.9978 3.1855 3.5953 3.9031 3.7941 3.8911 3.9954 3.9224 3.9406 3.8986 3.9330 4.3291 3.9059 1.0028 1.0052 0.9939 0.9996 1.0159 0.9998 0.9910 0.9890 1.0050 1.0047 1.0139 1.0105 0.9923 0.9979 0.9939
dispcorr: -0.013975283 hartree
energy: -1031.728656446678
dipole: -1.62532 1.41694 -0.20838 7.31693 -7.17089 0.14605 4.02047 -4.99508 -0.97461
magnitude: 1.00728 au
magnitude: 2.56031 debye
