program: Orca
programVersion: 5.0.4
elementType: S P O O O O N C C C C C C C C C C C C C C H H H H H H H H H H H H H H
charge: 0
multiplicity: 1
keywords: wb97x-d3
keywords: def2-TZVPP
keywords: def2/J RIJCOSX
keywords: DEFGRID2
keywords: scfconv7
keywords: smallprint printgap noloewdin
keywords: NOSOSCF
formula: C14H14NO4PS
InChI: InChI=1/C14H14NO4PS/c1-2-18-20(21,14-6-4-3-5-7-14)19-13-10-8-12(9-11-13)15(16)17/h3-11H,2H2,1H3
35 atoms
S  2.785967 2.128481 -1.551835
P  1.484353 1.167962 -0.515346
O  0.04529 1.149744 -1.289959
O  1.023837 1.811132 0.876845
O  -5.248096 -0.954924 1.218605
O  -4.636679 -2.693785 0.146514
N  -4.474829 -1.548639 0.502089
C  1.885683 -0.542712 -0.140612
C  -1.055651 0.475751 -0.821609
C  1.265876 -1.195346 0.926093
C  2.805836 -1.224362 -0.933367
C  2.002819 2.177331 1.876011
C  1.570314 -2.521364 1.191417
C  3.10435 -2.550425 -0.662409
C  -1.953149 1.129249 0.011065
C  -1.270826 -0.833752 -1.228301
C  2.487727 -3.198342 0.399358
C  -3.290806 -0.847916 0.042314
C  -3.083702 0.463887 0.445068
C  -2.398716 -1.50379 -0.794111
C  2.189863 3.672283 1.902835
H  0.551077 -0.680775 1.554953
H  3.295703 -0.718086 -1.755092
H  1.613562 1.808179 2.823529
H  2.951273 1.667938 1.690078
H  1.09183 -3.024651 2.02045
H  3.82381 -3.07528 -1.276123
H  -1.781942 2.154701 0.307571
H  -0.566232 -1.325176 -1.885353
H  2.726709 -4.231737 0.613357
H  -3.783639 0.974776 1.089583
H  -2.565643 -2.522632 -1.111225
H  2.869294 3.934728 2.713991
H  2.620439 4.037068 0.970768
H  1.245592 4.187639 2.078059
elementType: S P O N C H
totalener: -1637.20760234 hartree
nucrepener: 1983.04752616 hartree
electener: -3620.25512849 hartree
oneelecener: -6187.18184143 hartree
twoeener: 2566.92671294 hartree
cpcmener: -0.03092418 hartree
kineticenergy: 1632.09296480 hartree
xcener: -121.139857326158 hartree
chargesum: -0.0000000
charge: -0.437019 0.641824 -0.345616 -0.351855 -0.396392 -0.396183 0.545743 -0.032365 0.236521 -0.099996 -0.123260 0.042657 -0.191536 -0.179566 -0.132348 -0.144374 -0.110102 0.051878 -0.114961 -0.122971 -0.236403 0.153985 0.136314 0.107699 0.094844 0.163256 0.163648 0.155799 0.163942 0.164887 0.167156 0.165723 0.094955 0.074686 0.089428
qa: -0.4370 0.6418 -0.3456 -0.3519 -0.3964 -0.3962 0.5457 -0.0324 0.2365 -0.1000 -0.1233 0.0427 -0.1915 -0.1796 -0.1323 -0.1444 -0.1101 0.0519 -0.1150 -0.1230 -0.2364 0.1540 0.1363 0.1077 0.0948 0.1633 0.1636 0.1558 0.1639 0.1649 0.1672 0.1657 0.0950 0.0747 0.0894
va: 2.0466 5.2836 2.0911 2.0520 1.8587 1.8589 4.1356 3.5465 3.7700 3.8197 3.9290 3.8455 3.9373 3.9616 3.9936 3.9720 3.8774 3.7540 4.0426 4.0281 3.9486 0.9997 1.0274 0.9948 0.9986 0.9887 0.9888 1.0053 0.9910 0.9860 1.0103 1.0109 1.0081 1.0182 1.0038
dispcorr: -0.018522464 hartree
energy: -1637.226124799088
dipole: 11.77486 -10.18150 1.59336 1.98481 -2.71965 -0.73484 10.01259 -8.63378 1.37881
magnitude: 2.23157 au
magnitude: 5.67220 debye
