program: Orca
programVersion: 5.0.4
elementType: S P O O O O N C C C C C C C C C C C C C C H H H H H H H H H H H H H H
charge: 0
multiplicity: 1
keywords: wb97x-d3
keywords: def2-TZVPP
keywords: def2/J RIJCOSX
keywords: DEFGRID2
keywords: scfconv7
keywords: smallprint printgap noloewdin
keywords: NOSOSCF
formula: C14H14NO4PS
InChI: InChI=1/C14H14NO4PS/c1-2-18-20(21,14-6-4-3-5-7-14)19-13-10-8-12(9-11-13)15(16)17/h3-11H,2H2,1H3
35 atoms
S  1.0350 2.063524 -1.368008
P  1.421078 0.964337 0.162003
O  0.09631 0.612826 1.078245
O  2.343175 1.575951 1.307893
O  -4.968834 -1.861856 -1.578667
O  -5.825929 -1.018767 0.182057
N  -4.880127 -1.249913 -0.537558
C  2.196815 -0.622442 -0.132871
C  -1.094454 0.14676 0.622973
C  2.618751 -0.960167 -1.414228
C  2.392711 -1.507437 0.928472
C  2.336024 2.983923 1.644832
C  3.240818 -2.179814 -1.636493
C  3.018733 -2.721285 0.698957
C  -2.193881 0.360587 1.449306
C  -1.240049 -0.531757 -0.583483
C  3.443542 -3.056849 -0.581088
C  -3.576599 -0.770113 -0.13384
C  -3.439381 -0.098698 1.074012
C  -2.486362 -0.992284 -0.961334
C  3.478644 3.69319 0.964521
H  2.45975 -0.275345 -2.237302
H  2.061356 -1.261295 1.929183
H  1.37745 3.435485 1.383887
H  2.436362 3.021414 2.728477
H  3.566752 -2.442142 -2.633857
H  3.174695 -3.407905 1.520011
H  -2.070607 0.885903 2.386703
H  -0.402453 -0.72215 -1.238815
H  3.93184 -4.006642 -0.754814
H  -4.284492 0.073646 1.724232
H  -2.586533 -1.518357 -1.899157
H  3.368097 3.680652 -0.119498
H  3.499074 4.734112 1.288357
H  4.437379 3.243701 1.223228
elementType: S P O N C H
totalener: -1637.20846096 hartree
nucrepener: 1949.65610824 hartree
electener: -3586.86456920 hartree
oneelecener: -6120.92222786 hartree
twoeener: 2534.05765866 hartree
cpcmener: -0.02832314 hartree
kineticenergy: 1632.10156293 hartree
xcener: -121.142939568115 hartree
chargesum: 0.0000000
charge: -0.435693 0.693795 -0.330392 -0.362346 -0.401166 -0.401322 0.543845 0.018060 0.278214 -0.126365 -0.190576 0.037247 -0.157522 -0.160035 -0.170070 -0.106125 -0.128240 0.042559 -0.108820 -0.158349 -0.237058 0.141035 0.146095 0.091100 0.108762 0.163621 0.163999 0.154673 0.135432 0.165277 0.164741 0.163296 0.076294 0.095532 0.090505
qa: -0.4357 0.6938 -0.3304 -0.3623 -0.4012 -0.4013 0.5438 0.0181 0.2782 -0.1264 -0.1906 0.0372 -0.1575 -0.1600 -0.1701 -0.1061 -0.1282 0.0426 -0.1088 -0.1583 -0.2371 0.1410 0.1461 0.0911 0.1088 0.1636 0.1640 0.1547 0.1354 0.1653 0.1647 0.1633 0.0763 0.0955 0.0905
va: 2.0263 5.2088 2.1327 2.1108 1.8536 1.8525 4.1361 3.6071 3.7851 3.8752 3.9819 3.8549 3.9399 3.9195 4.0135 3.9307 3.8949 3.7544 4.0453 4.1230 3.9238 1.0274 1.0154 1.0087 0.9950 0.9889 0.9887 1.0028 1.0144 0.9868 1.0104 1.0153 1.0191 1.0080 1.0041
dispcorr: -0.016778706 hartree
energy: -1637.225239670541
dipole: 18.19399 -15.16034 3.03365 4.25018 -4.40531 -0.15514 4.95151 -3.39035 1.56116
magnitude: 3.41530 au
magnitude: 8.68102 debye
