program: Orca
programVersion: 5.0.4
elementType: S P O O O O N C C C C C C C C C C C C C C H H H H H H H H H H H H H H
charge: 0
multiplicity: 1
keywords: wb97x-d3
keywords: def2-TZVPP
keywords: def2/J RIJCOSX
keywords: DEFGRID2
keywords: scfconv7
keywords: smallprint printgap noloewdin
keywords: NOSOSCF
formula: C14H14NO4PS
InChI: InChI=1/C14H14NO4PS/c1-2-18-20(21,14-6-4-3-5-7-14)19-13-10-8-12(9-11-13)15(16)17/h3-11H,2H2,1H3
35 atoms
S  3.055574 1.827203 -1.550624
P  1.732337 1.056112 -0.38954
O  0.250718 1.234265 -1.085052
O  1.581548 1.694241 1.068494
O  -4.539746 -2.549818 0.135855
O  -4.984904 -0.955114 1.479556
N  -4.293118 -1.474939 0.633761
C  1.846914 -0.697836 -0.029446
C  -0.859243 0.563192 -0.638819
C  2.502257 -1.522315 -0.940093
C  1.22691 -1.250117 1.09218
C  1.918445 3.066225 1.365525
C  2.534112 -2.893168 -0.734199
C  1.261341 -2.621441 1.289128
C  -1.193799 -0.64782 -1.231599
C  -1.641995 1.109273 0.368503
C  1.911063 -3.443054 0.377228
C  -3.103347 -0.771417 0.193399
C  -2.324609 -1.32277 -0.815123
C  -2.776899 0.439494 0.786278
C  0.917996 4.0524 0.817072
H  2.989095 -1.097601 -1.8089
H  0.711514 -0.627295 1.811097
H  1.951689 3.111106 2.452477
H  2.921283 3.274779 0.98872
H  3.046534 -3.529852 -1.442834
H  0.777787 -3.048001 2.157613
H  -0.574472 -1.060007 -2.016853
H  -1.382905 2.058953 0.814898
H  1.9335 -4.513229 0.535248
H  -2.581901 -2.264234 -1.277905
H  -3.386291 0.86842 1.568007
H  1.209143 5.05466 1.133463
H  0.889017 4.048184 -0.272795
H  -0.0859 3.863965 1.196864
elementType: S P O N C H
totalener: -1637.20749438 hartree
nucrepener: 2000.87194662 hartree
electener: -3638.07944099 hartree
oneelecener: -6222.87127550 hartree
twoeener: 2584.79183451 hartree
cpcmener: -0.03071853 hartree
kineticenergy: 1632.08704708 hartree
xcener: -121.139268459889 hartree
chargesum: 0.0000000
charge: -0.439889 0.633208 -0.340574 -0.338938 -0.396586 -0.396604 0.546014 0.009025 0.184504 -0.127703 -0.136458 0.035869 -0.177322 -0.195190 -0.098640 -0.107598 -0.106761 0.078995 -0.156417 -0.145689 -0.261961 0.135136 0.150753 0.108213 0.094691 0.163481 0.163143 0.156318 0.180923 0.165483 0.165335 0.165286 0.109173 0.086031 0.094749
qa: -0.4399 0.6332 -0.3406 -0.3389 -0.3966 -0.3966 0.5460 0.0090 0.1845 -0.1277 -0.1365 0.0359 -0.1773 -0.1952 -0.0986 -0.1076 -0.1068 0.0790 -0.1564 -0.1457 -0.2620 0.1351 0.1508 0.1082 0.0947 0.1635 0.1631 0.1563 0.1809 0.1655 0.1653 0.1653 0.1092 0.0860 0.0947
va: 2.0416 5.2601 2.0614 2.1006 1.8583 1.8589 4.1353 3.5909 3.8474 3.9045 3.8963 3.8377 3.9603 3.9328 3.9523 3.9160 3.8783 3.7185 4.0526 4.0921 3.8926 1.0280 1.0088 0.9930 1.0147 0.9889 0.9894 0.9948 0.9775 0.9856 1.0115 1.0145 1.0090 1.0204 1.0022
dispcorr: -0.019278167 hartree
energy: -1637.226772543440
dipole: 5.98898 -5.08352 0.90546 4.88904 -4.79600 0.09304 5.84557 -4.87220 0.97337
magnitude: 1.33265 au
magnitude: 3.38733 debye
