program: Orca
programVersion: 5.0.4
elementType: S P O O O O N C C C C C C C C C C C C C C H H H H H H H H H H H H H H
charge: 0
multiplicity: 1
keywords: wb97x-d3
keywords: def2-TZVPP
keywords: def2/J RIJCOSX
keywords: DEFGRID2
keywords: scfconv7
keywords: smallprint printgap noloewdin
keywords: NOSOSCF
formula: C14H14NO4PS
InChI: InChI=1/C14H14NO4PS/c1-2-18-20(21,14-6-4-3-5-7-14)19-13-10-8-12(9-11-13)15(16)17/h3-11H,2H2,1H3
35 atoms
S  2.705121 2.166204 -1.739968
P  1.425235 1.2281 -0.657674
O  0.009511 1.062912 -1.465585
O  0.907424 1.96837 0.663817
O  -5.158552 -0.886256 1.407656
O  -4.536121 -2.713787 0.502625
N  -4.397145 -1.532788 0.725007
C  1.875103 -0.431977 -0.136369
C  -1.078618 0.423623 -0.920709
C  1.254156 -1.024788 0.963959
C  2.834496 -1.138465 -0.856415
C  1.756748 2.795364 1.483858
C  1.59681 -2.315802 1.333898
C  3.173662 -2.428264 -0.478689
C  -1.981595 1.143745 -0.150424
C  -1.268616 -0.927367 -1.177244
C  2.555202 -3.017265 0.615127
C  -3.254694 -0.854172 0.143269
C  -3.080301 0.500686 0.386583
C  -2.366407 -1.574713 -0.64215
C  2.770918 1.998996 2.265635
H  0.509678 -0.49123 1.539561
H  3.324032 -0.679514 -1.70542
H  2.24418 3.540664 0.852627
H  1.072197 3.315021 2.151462
H  1.115626 -2.772597 2.187816
H  3.924468 -2.970845 -1.036527
H  -1.836821 2.200519 0.024217
H  -0.563606 -1.471251 -1.79095
H  2.823242 -4.023031 0.910835
H  -3.780475 1.060542 0.988732
H  -2.509953 -2.627116 -0.837734
H  3.507032 1.520953 1.618183
H  3.308685 2.676057 2.929823
H  2.297133 1.233609 2.87997
elementType: S P O N C H
totalener: -1637.20714574 hartree
nucrepener: 1995.64985770 hartree
electener: -3632.85700344 hartree
oneelecener: -6212.42843511 hartree
twoeener: 2579.57143167 hartree
cpcmener: -0.02982654 hartree
kineticenergy: 1632.09869877 hartree
xcener: -121.142999595485 hartree
chargesum: -0.0000000
charge: -0.435635 0.638271 -0.346132 -0.345517 -0.396447 -0.395842 0.545732 -0.031752 0.221024 -0.121709 -0.111392 0.034186 -0.182376 -0.182887 -0.121969 -0.137112 -0.111274 0.052871 -0.117583 -0.125410 -0.251233 0.155751 0.135319 0.093535 0.108287 0.163073 0.163185 0.155340 0.163307 0.164806 0.166029 0.165589 0.085645 0.108794 0.093524
qa: -0.4356 0.6383 -0.3461 -0.3455 -0.3964 -0.3958 0.5457 -0.0318 0.2210 -0.1217 -0.1114 0.0342 -0.1824 -0.1829 -0.1220 -0.1371 -0.1113 0.0529 -0.1176 -0.1254 -0.2512 0.1558 0.1353 0.0935 0.1083 0.1631 0.1632 0.1553 0.1633 0.1648 0.1660 0.1656 0.0856 0.1088 0.0935
va: 2.0483 5.2796 2.0891 2.0695 1.8587 1.8594 4.1355 3.5229 3.7850 3.7975 3.9153 3.8457 3.9330 3.9632 3.9815 3.9679 3.8784 3.7489 4.0439 4.0270 3.9104 1.0007 1.0259 1.0121 0.9914 0.9883 0.9888 1.0041 0.9909 0.9858 1.0110 1.0108 1.0083 1.0113 1.0033
dispcorr: -0.019128867 hartree
energy: -1637.226274610129
dipole: 12.90324 -11.35785 1.54539 -0.51271 0.09467 -0.41803 10.84047 -9.54675 1.29372
magnitude: 2.05833 au
magnitude: 5.23185 debye
