program: Orca
programVersion: 5.0.4
elementType: S P O O O O N C C C C C C C C C C C C C C H H H H H H H H H H H H H H
charge: 0
multiplicity: 1
keywords: wb97x-d3
keywords: def2-TZVPP
keywords: def2/J RIJCOSX
keywords: DEFGRID2
keywords: scfconv7
keywords: smallprint printgap noloewdin
keywords: NOSOSCF
formula: C14H14NO4PS
InChI: InChI=1/C14H14NO4PS/c1-2-18-20(21,14-6-4-3-5-7-14)19-13-10-8-12(9-11-13)15(16)17/h3-11H,2H2,1H3
35 atoms
S  1.158808 1.341676 -1.912486
P  1.397474 0.371283 -0.268707
O  0.217572 -0.697072 0.102459
O  1.394445 1.225301 1.086241
O  -5.791663 0.968155 0.11953
O  -5.969128 -1.157038 0.118573
N  -5.308796 -0.142036 0.121265
C  2.814739 -0.721274 -0.177077
C  -1.125481 -0.483725 0.101665
C  3.660362 -0.860457 -1.272105
C  3.070445 -1.42667 1.00036
C  1.976816 2.541769 1.193146
C  4.757144 -1.706489 -1.19507
C  4.164138 -2.273102 1.067767
C  -1.913705 -1.630934 0.123353
C  -1.711605 0.778451 0.094183
C  5.006354 -2.4145 -0.028927
C  -3.866928 -0.262265 0.120574
C  -3.288428 -1.524546 0.136846
C  -3.089596 0.885867 0.100498
C  0.928844 3.520374 1.653985
H  3.465588 -0.30887 -2.182672
H  2.425279 -1.323671 1.863578
H  2.794516 2.466855 1.90978
H  2.398801 2.849902 0.234551
H  5.414416 -1.811981 -2.047524
H  4.360424 -2.824089 1.977639
H  -1.445605 -2.605839 0.132555
H  -1.125985 1.685797 0.086909
H  5.859692 -3.077201 0.029004
H  -3.888574 -2.422279 0.155033
H  -3.535978 1.869252 0.090045
H  0.140998 3.642618 0.910354
H  0.476012 3.209152 2.5955
H  1.394135 4.493383 1.813783
elementType: S P O N C H
totalener: -1637.20825996 hartree
nucrepener: 1934.40966781 hartree
electener: -3571.61792778 hartree
oneelecener: -6090.39901550 hartree
twoeener: 2518.78108772 hartree
cpcmener: -0.02842208 hartree
kineticenergy: 1632.09481113 hartree
xcener: -121.141979858662 hartree
chargesum: 0.0000000
charge: -0.434095 0.677617 -0.314970 -0.357250 -0.400708 -0.401596 0.544594 0.026043 0.273983 -0.129834 -0.205092 0.054939 -0.168548 -0.157749 -0.164347 -0.117475 -0.124931 0.044988 -0.111230 -0.160431 -0.245322 0.142802 0.146147 0.104598 0.085394 0.163132 0.163571 0.154422 0.141570 0.164643 0.165423 0.162614 0.085375 0.092378 0.099342
qa: -0.4341 0.6776 -0.3150 -0.3572 -0.4007 -0.4016 0.5446 0.0260 0.2740 -0.1298 -0.2051 0.0549 -0.1685 -0.1577 -0.1643 -0.1175 -0.1249 0.0450 -0.1112 -0.1604 -0.2453 0.1428 0.1461 0.1046 0.0854 0.1631 0.1636 0.1544 0.1416 0.1646 0.1654 0.1626 0.0854 0.0924 0.0993
va: 2.0361 5.2095 2.1936 2.0583 1.8541 1.8521 4.1339 3.6206 3.7993 3.8996 3.9847 3.8237 3.9549 3.9194 3.9928 3.9196 3.8964 3.7612 4.0474 4.1196 3.9210 1.0277 1.0166 0.9954 1.0183 0.9903 0.9896 1.0028 1.0116 0.9873 1.0101 1.0152 1.0058 1.0043 1.0095
dispcorr: -0.016587445 hartree
energy: -1637.224847409980
dipole: 16.14014 -12.43338 3.70677 5.23497 -5.62289 -0.38792 7.50973 -6.11644 1.39329
magnitude: 3.97893 au
magnitude: 10.11363 debye
