program: Orca
programVersion: 5.0.4
elementType: S P O O O O N C C C C C C C C C C C C C C H H H H H H H H H H H H H H
charge: 0
multiplicity: 1
keywords: wb97x-d3
keywords: def2-TZVPP
keywords: def2/J RIJCOSX
keywords: DEFGRID2
keywords: scfconv7
keywords: smallprint printgap noloewdin
keywords: NOSOSCF
formula: C14H14NO4PS
InChI: InChI=1/C14H14NO4PS/c1-2-18-20(21,14-6-4-3-5-7-14)19-13-10-8-12(9-11-13)15(16)17/h3-11H,2H2,1H3
35 atoms
S  1.158877 2.275799 -1.64836
P  1.253773 1.377955 0.051527
O  -0.137313 1.339944 0.919226
O  2.093787 2.101267 1.203968
O  -4.768759 -2.761436 0.282447
O  -5.175325 -1.501883 -1.389028
N  -4.517688 -1.809505 -0.420959
C  1.795961 -0.334131 0.001068
C  -1.1989 0.556843 0.551945
C  1.950222 -0.991205 -1.215299
C  2.073607 -1.001606 1.195995
C  3.308427 2.824212 0.918426
C  2.386064 -2.308011 -1.24008
C  2.508979 -2.316049 1.163398
C  -1.988709 0.904568 -0.535777
C  -1.489029 -0.561137 1.322414
C  2.667516 -2.968852 -0.053179
C  -3.367257 -0.992545 -0.08464
C  -3.081538 0.122296 -0.858872
C  -2.585747 -1.340649 1.008077
C  4.45018 1.919955 0.525417
H  1.736838 -0.475409 -2.142547
H  1.958313 -0.504974 2.150862
H  3.111072 3.565828 0.142184
H  3.533384 3.355689 1.841295
H  2.508431 -2.815744 -2.18734
H  2.728307 -2.831658 2.088705
H  -1.766388 1.786436 -1.119373
H  -0.867066 -0.81351 2.170307
H  3.011383 -3.994615 -0.074141
H  -3.696133 0.395599 -1.703712
H  -2.811627 -2.205605 1.614022
H  4.275446 1.426851 -0.431748
H  5.35334 2.522051 0.421582
H  4.640772 1.157505 1.280465
elementType: S P O N C H
totalener: -1637.20767311 hartree
nucrepener: 1979.86292028 hartree
electener: -3617.07059339 hartree
oneelecener: -6181.33607802 hartree
twoeener: 2564.26548463 hartree
cpcmener: -0.02847148 hartree
kineticenergy: 1632.09807515 hartree
xcener: -121.142166533388 hartree
chargesum: 0.0000000
charge: -0.437013 0.671155 -0.347051 -0.365630 -0.396464 -0.396461 0.545530 0.002939 0.215258 -0.127276 -0.193204 0.037961 -0.160604 -0.142769 -0.119019 -0.137144 -0.125541 0.054653 -0.125181 -0.127264 -0.252594 0.139536 0.147699 0.092832 0.113877 0.163878 0.164534 0.158559 0.165397 0.165257 0.164426 0.165847 0.083267 0.107734 0.092874
qa: -0.4370 0.6712 -0.3471 -0.3656 -0.3965 -0.3965 0.5455 0.0029 0.2153 -0.1273 -0.1932 0.0380 -0.1606 -0.1428 -0.1190 -0.1371 -0.1255 0.0547 -0.1252 -0.1273 -0.2526 0.1395 0.1477 0.0928 0.1139 0.1639 0.1645 0.1586 0.1654 0.1653 0.1644 0.1658 0.0833 0.1077 0.0929
va: 2.0340 5.2454 2.0932 2.0828 1.8584 1.8590 4.1361 3.5453 3.8381 3.9251 3.8865 3.8354 3.9396 3.9049 3.9917 3.9818 3.8945 3.7551 4.0777 4.0554 3.9149 1.0264 1.0152 1.0131 0.9911 0.9882 0.9870 1.0060 0.9935 0.9862 1.0128 1.0113 1.0075 1.0102 1.0056
dispcorr: -0.018234322 hartree
energy: -1637.225907430940
dipole: 21.02674 -17.95561 3.07113 -0.77869 0.44049 -0.33820 3.98096 -2.60770 1.37326
magnitude: 3.38114 au
magnitude: 8.59416 debye
