program: Orca
programVersion: 5.0.4
elementType: S P O O O O N C C C C C C C C C C C C C C H H H H H H H H H H H H H H
charge: 0
multiplicity: 1
keywords: wb97x-d3
keywords: def2-TZVPP
keywords: def2/J RIJCOSX
keywords: DEFGRID2
keywords: scfconv7
keywords: smallprint printgap noloewdin
keywords: NOSOSCF
formula: C14H14NO4PS
InChI: InChI=1/C14H14NO4PS/c1-2-18-20(21,14-6-4-3-5-7-14)19-13-10-8-12(9-11-13)15(16)17/h3-11H,2H2,1H3
35 atoms
S  1.218508 1.331035 -2.000036
P  1.406631 0.368493 -0.345849
O  0.220415 -0.707766 -0.016796
O  1.349314 1.226958 1.004293
O  -5.77894 0.984877 0.140325
O  -5.95907 -1.13372 0.303356
N  -5.297992 -0.124652 0.19999
C  2.823048 -0.719395 -0.19713
C  -1.119709 -0.484967 0.027877
C  3.0337 -1.426487 0.988192
C  3.713657 -0.85187 -1.256679
C  1.824315 2.583429 1.124865
C  4.128421 -2.267082 1.098817
C  4.810376 -1.692998 -1.136665
C  -1.908083 -1.624272 0.166834
C  -1.704959 0.775503 -0.049582
C  5.015567 -2.402051 0.037301
C  -3.858322 -0.251638 0.143793
C  -3.280702 -1.511839 0.227942
C  -3.081344 0.888212 0.00577
C  0.838045 3.374197 1.944109
H  2.352774 -1.330178 1.824335
H  3.553231 -0.299732 -2.173624
H  2.8032 2.549392 1.60423
H  1.947206 3.024637 0.134023
H  4.289996 -2.819244 2.014822
H  5.501879 -1.794074 -1.962146
H  -1.440983 -2.597759 0.229072
H  -1.120999 1.677488 -0.157127
H  5.868801 -3.061135 0.128586
H  -3.880429 -2.403386 0.337207
H  -3.527054 1.86973 -0.060291
H  0.693966 2.939229 2.933131
H  1.217649 4.387287 2.078108
H  -0.130104 3.441368 1.447103
elementType: S P O N C H
totalener: -1637.20819283 hartree
nucrepener: 1933.27993581 hartree
electener: -3570.48812864 hartree
oneelecener: -6088.09442355 hartree
twoeener: 2517.60629491 hartree
cpcmener: -0.02828045 hartree
kineticenergy: 1632.09705398 hartree
xcener: -121.142647582428 hartree
chargesum: -0.0000000
charge: -0.432310 0.681775 -0.312437 -0.356191 -0.401282 -0.401808 0.544608 0.020558 0.295232 -0.208774 -0.128620 0.051598 -0.156466 -0.168245 -0.178516 -0.126196 -0.126038 0.039131 -0.104546 -0.155052 -0.241526 0.145791 0.143134 0.107021 0.089626 0.163808 0.163213 0.154430 0.133436 0.164743 0.165505 0.163394 0.091600 0.095198 0.084204
qa: -0.4323 0.6818 -0.3124 -0.3562 -0.4013 -0.4018 0.5446 0.0206 0.2952 -0.2088 -0.1286 0.0516 -0.1565 -0.1682 -0.1785 -0.1262 -0.1260 0.0391 -0.1045 -0.1551 -0.2415 0.1458 0.1431 0.1070 0.0896 0.1638 0.1632 0.1544 0.1334 0.1647 0.1655 0.1634 0.0916 0.0952 0.0842
va: 2.0431 5.2093 2.1952 2.0639 1.8536 1.8519 4.1340 3.6174 3.7928 3.9892 3.8961 3.8114 3.9181 3.9557 4.0041 3.9170 3.8981 3.7705 4.0420 4.1192 3.9363 1.0166 1.0267 0.9938 1.0195 0.9894 0.9904 1.0029 1.0254 0.9873 1.0100 1.0151 1.0036 1.0087 1.0037
dispcorr: -0.016451082 hartree
energy: -1637.224643911909
dipole: 15.57659 -11.96262 3.61397 5.00844 -5.37276 -0.36432 8.36833 -6.99182 1.37651
magnitude: 3.88436 au
magnitude: 9.87326 debye
