program: Orca
programVersion: 5.0.4
elementType: S P O O O O N C C C C C C C C C C C C C C H H H H H H H H H H H H H H
charge: 0
multiplicity: 1
keywords: wb97x-d3
keywords: def2-TZVPP
keywords: def2/J RIJCOSX
keywords: DEFGRID2
keywords: scfconv7
keywords: smallprint printgap noloewdin
keywords: NOSOSCF
formula: C14H14NO4PS
InChI: InChI=1/C14H14NO4PS/c1-2-18-20(21,14-6-4-3-5-7-14)19-13-10-8-12(9-11-13)15(16)17/h3-11H,2H2,1H3
35 atoms
S  0.983705 1.572109 -1.945426
P  1.519679 0.974777 -0.196584
O  0.307819 1.001746 0.924948
O  2.598621 1.841703 0.58564
O  -5.430487 -0.744909 -0.728085
O  -4.827886 -2.466346 0.376834
N  -4.624984 -1.358373 -0.065667
C  2.174845 -0.692583 -0.111508
C  -0.906711 0.425636 0.673587
C  3.222322 -1.02807 0.744627
C  1.589335 -1.671458 -0.913974
C  2.715926 3.273263 0.428812
C  3.684923 -2.334842 0.783207
C  2.045778 -2.978605 -0.855165
C  -1.882449 1.140545 -0.009496
C  -1.14881 -0.862438 1.132754
C  3.097199 -3.30986 -0.011152
C  -3.343022 -0.736193 0.203236
C  -3.111592 0.55598 -0.24775
C  -2.378338 -1.44936 0.900951
C  1.562135 4.027397 1.041446
H  3.688752 -0.284276 1.375685
H  0.78372 -1.415029 -1.590399
H  3.651676 3.523655 0.924294
H  2.82185 3.507706 -0.631813
H  4.5081 -2.590402 1.436771
H  1.586893 -3.735014 -1.477648
H  -1.686786 2.148794 -0.346046
H  -0.38211 -1.402233 1.671815
H  3.462009 -4.327874 0.024599
H  -3.868385 1.1119 -0.78126
H  -2.563241 -2.452608 1.255877
H  0.630915 3.873858 0.495913
H  1.409299 3.751752 2.084643
H  1.788256 5.093518 1.00822
elementType: S P O N C H
totalener: -1637.20763767 hartree
nucrepener: 1975.29818752 hartree
electener: -3612.50582519 hartree
oneelecener: -6172.26328282 hartree
twoeener: 2559.75745763 hartree
cpcmener: -0.02775670 hartree
kineticenergy: 1632.09670877 hartree
xcener: -121.141034311422 hartree
chargesum: 0.0000000
charge: -0.444415 0.678970 -0.358095 -0.351964 -0.397003 -0.397397 0.545357 0.011165 0.265983 -0.163233 -0.155462 0.027904 -0.164989 -0.162238 -0.147843 -0.159431 -0.124328 0.048181 -0.120937 -0.108738 -0.236481 0.155027 0.136867 0.109279 0.095153 0.163841 0.164112 0.155427 0.168116 0.165099 0.165480 0.165501 0.079120 0.090053 0.101918
qa: -0.4444 0.6790 -0.3581 -0.3520 -0.3970 -0.3974 0.5454 0.0112 0.2660 -0.1632 -0.1555 0.0279 -0.1650 -0.1622 -0.1478 -0.1594 -0.1243 0.0482 -0.1209 -0.1087 -0.2365 0.1550 0.1369 0.1093 0.0952 0.1638 0.1641 0.1554 0.1681 0.1651 0.1655 0.1655 0.0791 0.0901 0.1019
va: 2.0134 5.2230 2.0489 2.1344 1.8584 1.8577 4.1357 3.6154 3.7688 3.9541 3.8902 3.8506 3.9170 3.9405 4.0007 4.0146 3.8922 3.7563 4.0496 4.0398 3.8863 1.0137 1.0247 0.9919 1.0120 0.9889 0.9885 0.9998 0.9870 0.9863 1.0122 1.0107 1.0137 1.0080 1.0081
dispcorr: -0.017974982 hartree
energy: -1637.225612649662
dipole: 13.32796 -10.56140 2.76657 5.65148 -5.30650 0.34498 5.36927 -3.87508 1.49419
magnitude: 3.16315 au
magnitude: 8.04008 debye
