program: Orca
programVersion: 5.0.4
elementType: S P O O O O N C C C C C C C C C C C C C C H H H H H H H H H H H H H H
charge: 0
multiplicity: 1
keywords: wb97x-d3
keywords: def2-TZVPP
keywords: def2/J RIJCOSX
keywords: DEFGRID2
keywords: scfconv7
keywords: smallprint printgap noloewdin
keywords: NOSOSCF
formula: C14H14NO4PS
InChI: InChI=1/C14H14NO4PS/c1-2-18-20(21,14-6-4-3-5-7-14)19-13-10-8-12(9-11-13)15(16)17/h3-11H,2H2,1H3
35 atoms
S  1.285793 1.789349 -1.84309
P  1.596972 0.938751 -0.14631
O  0.2651 0.824204 0.813561
O  2.557964 1.683141 0.884192
O  -5.690506 -0.876316 0.603987
O  -5.003812 -1.85503 -1.162322
N  -4.818132 -1.165062 -0.184699
C  2.265648 -0.724148 -0.157498
C  -0.949597 0.314602 0.499823
C  2.671538 -1.303898 -1.354745
C  2.382985 -1.428608 1.041929
C  2.675506 3.121586 0.949131
C  3.19572 -2.588484 -1.354715
C  2.907622 -2.710371 1.032956
C  -1.185176 -0.515178 -0.592541
C  -1.986443 0.654994 1.365607
C  3.313579 -3.28977 -0.163458
C  -3.485737 -0.655645 0.052736
C  -2.460244 -1.000867 -0.814191
C  -3.257147 0.168931 1.147439
C  1.471913 3.783534 1.574396
H  2.574793 -0.75783 -2.28436
H  2.064613 -0.990411 1.979431
H  3.56894 3.294788 1.546309
H  2.861175 3.510498 -0.054011
H  3.509806 -3.04023 -2.286011
H  2.998091 -3.258647 1.961009
H  -0.397911 -0.802704 -1.275025
H  -1.789856 1.301479 2.210267
H  3.719679 -4.292671 -0.164874
H  -2.633956 -1.648187 -1.661325
H  -4.052305 0.441838 1.825623
H  0.583885 3.705153 0.946259
H  1.246463 3.367479 2.5566
H  1.688665 4.844633 1.703839
elementType: S P O N C H
totalener: -1637.20926612 hartree
nucrepener: 1958.27257636 hartree
electener: -3595.48184248 hartree
oneelecener: -6138.06596491 hartree
twoeener: 2542.58412243 hartree
cpcmener: -0.02825751 hartree
kineticenergy: 1632.09111443 hartree
xcener: -121.141768595083 hartree
chargesum: -0.0000000
charge: -0.432777 0.676601 -0.322191 -0.355024 -0.402088 -0.401768 0.544292 0.021675 0.287674 -0.129125 -0.193046 0.022326 -0.159347 -0.157922 -0.110787 -0.168898 -0.127814 0.038748 -0.151052 -0.108535 -0.241072 0.139844 0.146199 0.111518 0.094432 0.163509 0.163669 0.129141 0.155513 0.165069 0.163220 0.165075 0.080975 0.090830 0.101135
qa: -0.4328 0.6766 -0.3222 -0.3550 -0.4021 -0.4018 0.5443 0.0217 0.2877 -0.1291 -0.1930 0.0223 -0.1593 -0.1579 -0.1108 -0.1689 -0.1278 0.0387 -0.1511 -0.1085 -0.2411 0.1398 0.1462 0.1115 0.0944 0.1635 0.1637 0.1291 0.1555 0.1651 0.1632 0.1651 0.0810 0.0908 0.1011
va: 2.0381 5.2107 2.1221 2.1172 1.8514 1.8530 4.1353 3.6059 3.7771 3.8838 3.9742 3.8582 3.9428 3.9175 3.9514 3.9990 3.8943 3.7586 4.1245 4.0437 3.8841 1.0287 1.0155 0.9913 1.0103 0.9891 0.9890 1.0202 1.0002 0.9870 1.0144 1.0107 1.0184 1.0063 1.0084
dispcorr: -0.017257079 hartree
energy: -1637.226523196562
dipole: 13.19214 -10.26687 2.92528 4.49567 -4.48969 0.00598 6.85272 -5.34183 1.51088
magnitude: 3.29242 au
magnitude: 8.36867 debye
