program: Orca
programVersion: 5.0.4
elementType: S P O O O O N C C C C C C C C C C C C C C H H H H H H H H H H H H H H
charge: 0
multiplicity: 1
keywords: wb97x-d3
keywords: def2-TZVPP
keywords: def2/J RIJCOSX
keywords: DEFGRID2
keywords: scfconv7
keywords: smallprint printgap noloewdin
keywords: NOSOSCF
formula: C14H14NO4PS
InChI: InChI=1/C14H14NO4PS/c1-2-18-20(21,14-6-4-3-5-7-14)19-13-10-8-12(9-11-13)15(16)17/h3-11H,2H2,1H3
35 atoms
S  1.006401 1.862727 -1.768263
P  1.550016 1.005834 -0.132974
O  0.354807 0.91018 1.00392
O  2.677314 1.721307 0.732662
O  -5.451709 -0.571789 -0.6768
O  -4.767019 -2.47414 -0.0005
N  -4.599447 -1.29476 -0.212929
C  2.139519 -0.68251 -0.252618
C  -0.861418 0.368535 0.691148
C  2.906196 -1.23926 0.771892
C  1.750281 -1.464074 -1.336299
C  2.806399 3.156522 0.827126
C  3.288835 -2.568406 0.69599
C  2.126646 -2.797865 -1.397681
C  -1.087976 -0.97852 0.94236
C  -1.853645 1.174948 0.148796
C  2.897767 -3.348578 -0.384922
C  -3.306789 -0.718474 0.103212
C  -2.321847 -1.528525 0.650164
C  -3.088069 0.628981 -0.146854
C  1.706483 3.792897 1.639747
H  3.209787 -0.650439 1.626796
H  1.153648 -1.035215 -2.13098
H  3.776192 3.309429 1.297161
H  2.846918 3.576909 -0.179454
H  3.89228 -2.996838 1.484616
H  1.818451 -3.4041 -2.238577
H  -0.308325 -1.592389 1.372547
H  -1.665635 2.223393 -0.03354
H  3.1965 -4.38719 -0.436284
H  -2.498016 -2.575128 0.849969
H  -3.859753 1.257498 -0.565887
H  0.740704 3.747826 1.136933
H  1.613746 3.331971 2.622445
H  1.949582 4.845521 1.787047
elementType: S P O N C H
totalener: -1637.20847723 hartree
nucrepener: 1978.08656304 hartree
electener: -3615.29504027 hartree
oneelecener: -6177.86291831 hartree
twoeener: 2562.56787804 hartree
cpcmener: -0.02758348 hartree
kineticenergy: 1632.10380355 hartree
xcener: -121.141862225218 hartree
chargesum: -0.0000000
charge: -0.440745 0.679149 -0.357544 -0.352968 -0.397418 -0.397358 0.545503 -0.015449 0.264134 -0.160224 -0.127097 0.027905 -0.170060 -0.166908 -0.159144 -0.140193 -0.116258 0.051397 -0.110180 -0.124442 -0.235049 0.148873 0.137288 0.109736 0.093852 0.163648 0.164008 0.164988 0.155017 0.165082 0.164650 0.165632 0.078999 0.089821 0.101354
qa: -0.4407 0.6791 -0.3575 -0.3530 -0.3974 -0.3974 0.5455 -0.0154 0.2641 -0.1602 -0.1271 0.0279 -0.1701 -0.1669 -0.1591 -0.1402 -0.1163 0.0514 -0.1102 -0.1244 -0.2350 0.1489 0.1373 0.1097 0.0939 0.1636 0.1640 0.1650 0.1550 0.1651 0.1646 0.1656 0.0790 0.0898 0.1014
va: 2.0262 5.2271 2.0441 2.1333 1.8579 1.8580 4.1361 3.6165 3.7926 3.9453 3.8796 3.8525 3.9293 3.9467 4.0053 3.9942 3.8863 3.7530 4.0394 4.0512 3.8886 1.0163 1.0280 0.9915 1.0121 0.9892 0.9888 0.9875 0.9998 0.9864 1.0117 1.0121 1.0133 1.0077 1.0082
dispcorr: -0.018009763 hartree
energy: -1637.226486990282
dipole: 13.25702 -10.52146 2.73557 4.43912 -4.38736 0.05176 6.54975 -5.00616 1.54359
magnitude: 3.14144 au
magnitude: 7.98491 debye
