program: Orca
programVersion: 5.0.4
elementType: S P O O O O N C C C C C C C C C C C C C C H H H H H H H H H H H H H H
charge: 0
multiplicity: 1
keywords: wb97x-d3
keywords: def2-TZVPP
keywords: def2/J RIJCOSX
keywords: DEFGRID2
keywords: scfconv7
keywords: smallprint printgap noloewdin
keywords: NOSOSCF
formula: C14H14NO4PS
InChI: InChI=1/C14H14NO4PS/c1-2-18-20(21,14-6-4-3-5-7-14)19-13-10-8-12(9-11-13)15(16)17/h3-11H,2H2,1H3
35 atoms
S  2.874038 2.030057 -1.593826
P  1.747808 1.080493 -0.358228
O  0.190753 1.26693 -0.848965
O  1.794293 1.564938 1.161353
O  -5.313209 -1.531539 -0.259063
O  -4.517981 -1.950326 1.674185
N  -4.435078 -1.459226 0.570928
C  1.96086 -0.693052 -0.197389
C  -0.910817 0.583727 -0.433509
C  2.599581 -1.249307 0.908443
C  1.521775 -1.513654 -1.236601
C  1.973284 2.947463 1.537074
C  2.786107 -2.622392 0.975318
C  1.706367 -2.884183 -1.157804
C  -1.049597 0.042114 0.839972
C  -1.933758 0.467964 -1.369504
C  2.338382 -3.439543 -0.052581
C  -3.223162 -0.748205 0.225542
C  -2.211225 -0.632511 1.166334
C  -3.096649 -0.196713 -1.042516
C  0.760925 3.791884 1.232084
H  2.951641 -0.627939 1.720351
H  1.0315 -1.094331 -2.106691
H  2.16706 2.915972 2.6074
H  2.863612 3.339248 1.042084
H  3.280136 -3.052495 1.836144
H  1.356051 -3.519017 -1.960373
H  -0.278581 0.13926 1.589838
H  -1.812312 0.896801 -2.354944
H  2.481649 -4.510342 0.006718
H  -2.3104 -1.054896 2.155372
H  -3.883955 -0.280793 -1.77704
H  -0.144292 3.365784 1.664953
H  0.905794 4.780522 1.66845
H  0.609661 3.926188 0.161083
elementType: S P O N C H
totalener: -1637.20851449 hartree
nucrepener: 1983.23812481 hartree
electener: -3620.44663930 hartree
oneelecener: -6187.53886192 hartree
twoeener: 2567.09222262 hartree
cpcmener: -0.03124683 hartree
kineticenergy: 1632.08876245 hartree
xcener: -121.141087359281 hartree
chargesum: 0.0000000
charge: -0.440444 0.627301 -0.320042 -0.336471 -0.400561 -0.400567 0.544833 0.021824 0.225850 -0.151946 -0.157445 0.030293 -0.162235 -0.167276 -0.110629 -0.154746 -0.119907 0.046468 -0.130053 -0.110448 -0.248168 0.150733 0.147239 0.110326 0.097718 0.163289 0.164348 0.150718 0.153800 0.165610 0.164967 0.164673 0.091139 0.105748 0.084064
qa: -0.4404 0.6273 -0.3200 -0.3365 -0.4006 -0.4006 0.5448 0.0218 0.2258 -0.1519 -0.1574 0.0303 -0.1622 -0.1673 -0.1106 -0.1547 -0.1199 0.0465 -0.1301 -0.1104 -0.2482 0.1507 0.1472 0.1103 0.0977 0.1633 0.1643 0.1507 0.1538 0.1656 0.1650 0.1647 0.0911 0.1057 0.0841
va: 2.0365 5.2321 2.0899 2.0842 1.8531 1.8548 4.1364 3.5722 3.7964 3.9246 3.9179 3.8303 3.9198 3.9271 3.8944 4.0079 3.8813 3.7568 4.0829 4.0516 3.8965 1.0149 1.0083 0.9932 1.0151 0.9889 0.9885 1.0139 1.0043 0.9863 1.0132 1.0102 1.0040 1.0087 1.0199
dispcorr: -0.018518971 hartree
energy: -1637.227033458167
dipole: 6.61111 -5.31775 1.29336 3.89131 -3.87544 0.01587 6.39460 -5.30361 1.09099
magnitude: 1.69213 au
magnitude: 4.30105 debye
