program: Orca
programVersion: 5.0.4
elementType: S P O O O O N C C C C C C C C C C C C C C H H H H H H H H H H H H H H
charge: 0
multiplicity: 1
keywords: wb97x-d3
keywords: def2-TZVPP
keywords: def2/J RIJCOSX
keywords: DEFGRID2
keywords: scfconv7
keywords: smallprint printgap noloewdin
keywords: NOSOSCF
formula: C14H14NO4PS
InChI: InChI=1/C14H14NO4PS/c1-2-18-20(21,14-6-4-3-5-7-14)19-13-10-8-12(9-11-13)15(16)17/h3-11H,2H2,1H3
35 atoms
S  1.2835 1.892393 -1.593221
P  1.283049 0.430427 -0.340891
O  0.16939 -0.742927 -0.584517
O  0.912841 0.809494 1.17141
O  -5.764944 -0.653771 1.265372
O  -5.90755 0.615518 -0.441813
N  -5.277107 -0.080126 0.319658
C  2.765604 -0.576454 -0.276177
C  -1.164865 -0.537533 -0.363013
C  2.893256 -1.540851 0.724976
C  3.786273 -0.391107 -1.201811
C  1.262455 2.073674 1.764978
C  4.041826 -2.311188 0.792797
C  4.933263 -1.168547 -1.129061
C  -1.742107 -1.124055 0.75532
C  -1.926405 0.200299 -1.259238
C  5.061265 -2.126076 -0.133439
C  -3.853395 -0.237271 0.084435
C  -3.097912 -0.983601 0.978323
C  -3.281445 0.35563 -1.031808
C  2.739357 2.188446 2.051159
H  2.108333 -1.693437 1.455159
H  3.688514 0.359814 -1.975618
H  0.924694 2.883497 1.115036
H  0.681236 2.118524 2.684918
H  4.142723 -3.056662 1.570665
H  5.726437 -1.023709 -1.850556
H  -1.134911 -1.699031 1.441784
H  -1.47308 0.638533 -2.137374
H  5.957881 -2.729566 -0.075651
H  -3.545666 -1.446771 1.845768
H  -3.873544 0.929011 -1.730277
H  2.927104 3.127533 2.573416
H  3.092513 1.375924 2.686532
H  3.334303 2.199161 1.136512
elementType: S P O N C H
totalener: -1637.21869705 hartree
nucrepener: 1949.35395511 hartree
electener: -3586.57265216 hartree
oneelecener: -6120.39337766 hartree
twoeener: 2533.82072550 hartree
cpcmener: -0.02353675 hartree
kineticenergy: 1632.09935358 hartree
xcener: -121.140132088063 hartree
chargesum: -0.0000000
charge: -0.431088 0.655576 -0.353532 -0.348032 -0.384515 -0.384263 0.531059 0.003297 0.240197 -0.176541 -0.111523 0.038517 -0.158428 -0.163026 -0.145685 -0.124459 -0.118922 0.052522 -0.118444 -0.134944 -0.243538 0.143264 0.139698 0.091670 0.107969 0.159789 0.159459 0.155319 0.155262 0.161419 0.163073 0.162687 0.104124 0.090520 0.081517
qa: -0.4311 0.6556 -0.3535 -0.3480 -0.3845 -0.3843 0.5311 0.0033 0.2402 -0.1765 -0.1115 0.0385 -0.1584 -0.1630 -0.1457 -0.1245 -0.1189 0.0525 -0.1184 -0.1349 -0.2435 0.1433 0.1397 0.0917 0.1080 0.1598 0.1595 0.1553 0.1553 0.1614 0.1631 0.1627 0.1041 0.0905 0.0815
va: 2.0520 5.2341 2.1138 2.0673 1.8731 1.8734 4.1614 3.6170 3.7988 3.9433 3.8980 3.8458 3.9272 3.9504 4.0010 4.0125 3.8958 3.7528 4.0323 4.0859 3.9141 1.0105 1.0272 1.0151 0.9907 0.9904 0.9908 0.9963 1.0085 0.9879 1.0127 1.0138 1.0115 1.0057 1.0099
dispcorr: -0.017256898 hartree
energy: -1637.235953950770
dipole: 19.43508 -16.26963 3.16545 1.37832 -2.22410 -0.84578 8.75082 -7.54109 1.20972
magnitude: 3.49269 au
magnitude: 8.87771 debye
