program: Orca
programVersion: 5.0.4
elementType: S P O O O O N C C C C C C C C C C C C C C H H H H H H H H H H H H H H
charge: 0
multiplicity: 1
keywords: wb97x-d3
keywords: def2-TZVPP
keywords: def2/J RIJCOSX
keywords: DEFGRID2
keywords: scfconv7
keywords: smallprint printgap noloewdin
keywords: NOSOSCF
formula: C14H14NO4PS
InChI: InChI=1/C14H14NO4PS/c1-2-18-20(21,14-6-4-3-5-7-14)19-13-10-8-12(9-11-13)15(16)17/h3-11H,2H2,1H3
35 atoms
S  1.139135 1.863607 -1.71122
P  1.546195 0.994806 -0.04406
O  0.267575 0.881537 0.990419
O  2.587208 1.706063 0.925713
O  -4.869418 -2.455624 -0.071741
O  -5.475756 -0.587959 -0.903322
N  -4.665114 -1.298455 -0.35614
C  2.171995 -0.682746 -0.150173
C  -0.931335 0.34547 0.622872
C  1.686103 -1.513773 -1.157801
C  3.086807 -1.175977 0.779617
C  2.747024 3.139033 0.998827
C  2.109784 -2.831617 -1.23237
C  3.518307 -2.490099 0.687102
C  -1.882144 1.136653 -0.009637
C  -1.196785 -0.983388 0.929377
C  3.029751 -3.318602 -0.314042
C  -3.371892 -0.730489 -0.020653
C  -3.113173 0.596921 -0.331789
C  -2.426651 -1.527034 0.609882
C  1.591609 3.824769 1.684661
H  0.982064 -1.134461 -1.88814
H  3.473471 -0.548517 1.571182
H  3.670183 3.280503 1.558136
H  2.898926 3.534471 -0.007574
H  1.726047 -3.474401 -2.013705
H  4.239547 -2.866635 1.400721
H  -1.670247 2.171821 -0.237597
H  -0.450244 -1.587224 1.428017
H  3.369256 -4.344205 -0.379684
H  -3.852469 1.215927 -0.819047
H  -2.631649 -2.55925 0.85417
H  1.392103 3.396101 2.666996
H  1.845973 4.876367 1.826386
H  0.677177 3.788556 1.092051
elementType: S P O N C H
totalener: -1637.21854198 hartree
nucrepener: 1971.46785994 hartree
electener: -3608.68640192 hartree
oneelecener: -6164.56411373 hartree
twoeener: 2555.87771181 hartree
cpcmener: -0.02356625 hartree
kineticenergy: 1632.09239485 hartree
xcener: -121.139354082321 hartree
chargesum: -0.0000000
charge: -0.435182 0.665444 -0.348475 -0.343988 -0.385176 -0.384488 0.531404 0.003419 0.255329 -0.145419 -0.158926 0.024223 -0.160181 -0.163178 -0.136542 -0.153172 -0.120660 0.047835 -0.126188 -0.113237 -0.235964 0.134513 0.151916 0.106715 0.095313 0.161261 0.160166 0.151143 0.162376 0.161958 0.164038 0.163518 0.089813 0.099896 0.080497
qa: -0.4352 0.6654 -0.3485 -0.3440 -0.3852 -0.3845 0.5314 0.0034 0.2553 -0.1454 -0.1589 0.0242 -0.1602 -0.1632 -0.1365 -0.1532 -0.1207 0.0478 -0.1262 -0.1132 -0.2360 0.1345 0.1519 0.1067 0.0953 0.1613 0.1602 0.1511 0.1624 0.1620 0.1640 0.1635 0.0898 0.0999 0.0805
va: 2.0260 5.2397 2.0568 2.1384 1.8722 1.8735 4.1616 3.6256 3.7873 3.8920 3.9542 3.8595 3.9453 3.9268 3.9977 4.0045 3.8950 3.7587 4.0575 4.0427 3.8872 1.0271 1.0153 0.9916 1.0118 0.9894 0.9902 1.0032 0.9893 0.9875 1.0133 1.0121 1.0073 1.0085 1.0140
dispcorr: -0.017847499 hartree
energy: -1637.236389482190
dipole: 13.17565 -10.56159 2.61406 4.57842 -4.50415 0.07427 6.78765 -5.26224 1.52542
magnitude: 3.02749 au
magnitude: 7.69527 debye
