program: Orca
programVersion: 5.0.4
elementType: S P O O O O N C C C C C C C C C C C C C C H H H H H H H H H H H H H H
charge: 0
multiplicity: 1
keywords: wb97x-d3
keywords: def2-TZVPP
keywords: def2/J RIJCOSX
keywords: DEFGRID2
keywords: scfconv7
keywords: smallprint printgap noloewdin
keywords: NOSOSCF
formula: C14H14NO4PS
InChI: InChI=1/C14H14NO4PS/c1-2-18-20(21,14-6-4-3-5-7-14)19-13-10-8-12(9-11-13)15(16)17/h3-11H,2H2,1H3
35 atoms
S  1.053641 2.058768 -1.380646
P  1.417725 0.972055 0.154212
O  0.097556 0.601221 1.065423
O  2.32527 1.585996 1.312891
O  -4.984841 -1.884116 -1.544798
O  -5.827491 -1.02979 0.226991
N  -4.902329 -1.267844 -0.510592
C  2.2053 -0.615171 -0.133895
C  -1.095549 0.145156 0.612828
C  2.641165 -0.943221 -1.412499
C  2.391063 -1.509964 0.919211
C  2.313151 2.990483 1.618693
C  3.261168 -2.162515 -1.639685
C  3.014472 -2.723475 0.686185
C  -2.192477 0.369455 1.438812
C  -1.252174 -0.54009 -0.587286
C  3.44913 -3.049996 -0.591725
C  -3.587728 -0.776301 -0.121962
C  -3.441117 -0.091234 1.074895
C  -2.502713 -1.002485 -0.952203
C  3.507201 3.674646 0.996628
H  2.492261 -0.242795 -2.22479
H  2.052067 -1.265059 1.917347
H  1.384218 3.452455 1.276128
H  2.337673 3.056378 2.706534
H  3.598127 -2.416696 -2.635677
H  3.161393 -3.417724 1.502567
H  -2.057518 0.906393 2.367826
H  -0.414384 -0.723343 -1.244666
H  3.934341 -4.000714 -0.769233
H  -4.291802 0.084157 1.716561
H  -2.625537 -1.5368 -1.882509
H  3.456695 3.633437 -0.090761
H  3.526012 4.723629 1.294061
H  4.440705 3.215889 1.321579
totalener: -1637.20069485 hartree
nucrepener: 1949.56362987 hartree
electener: -3586.76432472 hartree
oneelecener: -6120.49916776 hartree
twoeener: 2533.73484304 hartree
kineticenergy: 1632.14494833 hartree
xcener: -121.147906247106 hartree
chargesum: 0.0000000
charge: -0.363302 0.634209 -0.320149 -0.326164 -0.337761 -0.339346 0.491850 -0.020407 0.245370 -0.115829 -0.156099 0.015055 -0.122943 -0.129713 -0.139681 -0.051773 -0.102696 -0.016966 -0.102217 -0.152585 -0.220144 0.138466 0.120058 0.083632 0.094953 0.133920 0.131912 0.127035 0.106075 0.134156 0.154303 0.153583 0.086202 0.081225 0.085772
qa: -0.3633 0.6342 -0.3201 -0.3262 -0.3378 -0.3393 0.4918 -0.0204 0.2454 -0.1158 -0.1561 0.0151 -0.1229 -0.1297 -0.1397 -0.0518 -0.1027 -0.0170 -0.1022 -0.1526 -0.2201 0.1385 0.1201 0.0836 0.0950 0.1339 0.1319 0.1270 0.1061 0.1342 0.1543 0.1536 0.0862 0.0812 0.0858
va: 2.0973 5.2642 2.1417 2.1267 1.9160 1.9126 4.1960 3.7229 3.8840 3.9093 4.0330 3.8994 3.9785 3.9696 4.0084 3.9196 3.9525 3.8951 4.0698 4.1387 3.9180 1.0319 1.0236 1.0108 0.9943 0.9993 0.9996 1.0122 1.0293 0.9974 1.0172 1.0212 1.0212 1.0112 1.0052
dispcorr: -0.016738278 hartree
energy: -1637.217433126486
dipole: 18.22559 -15.84637 2.37921 4.28565 -4.31074 -0.02509 4.90050 -3.85262 1.04787
magnitude: 2.59987 au
magnitude: 6.60835 debye
