program: Orca
programVersion: 5.0.4
elementType: S P O O O O N C C C C C C C C C C C C C C H H H H H H H H H H H H H H
charge: 0
multiplicity: 1
keywords: wb97x-d3
keywords: def2-TZVPP
keywords: def2/J RIJCOSX
keywords: DEFGRID2
keywords: scfconv7
keywords: smallprint printgap noloewdin
keywords: NOSOSCF
formula: C14H14NO4PS
InChI: InChI=1/C14H14NO4PS/c1-2-18-20(21,14-6-4-3-5-7-14)19-13-10-8-12(9-11-13)15(16)17/h3-11H,2H2,1H3
35 atoms
S  1.143909 2.198216 -1.619029
P  1.262615 1.336509 0.09059
O  -0.109576 1.266724 0.979196
O  2.122424 2.067256 1.224411
O  -4.773074 -2.748458 0.112028
O  -5.211928 -1.345198 -1.443064
N  -4.545924 -1.746439 -0.520604
C  1.829754 -0.372998 0.058586
C  -1.18074 0.52484 0.57435
C  1.883072 -1.070363 -1.142315
C  2.19444 -1.005177 1.247784
C  3.271075 2.857567 0.895694
C  2.296622 -2.394078 -1.156492
C  2.608315 -2.326002 1.227082
C  -1.989988 0.958755 -0.467528
C  -1.465679 -0.651945 1.253641
C  2.657867 -3.021119 0.025587
C  -3.376166 -0.960996 -0.141787
C  -3.094502 0.209264 -0.828466
C  -2.572874 -1.399123 0.89923
C  4.45012 2.016696 0.459082
H  1.605521 -0.5720 -2.062313
H  2.164824 -0.467306 2.186858
H  3.00516 3.581171 0.12189
H  3.499849 3.407335 1.807763
H  2.336425 -2.934447 -2.092629
H  2.895738 -2.814957 2.148387
H  -1.758753 1.878357 -0.985927
H  -0.823725 -0.975599 2.061068
H  2.980592 -4.05383 0.012772
H  -3.730704 0.538987 -1.63613
H  -2.804006 -2.312392 1.426895
H  4.256534 1.512643 -0.488131
H  5.319965 2.658387 0.316215
H  4.706112 1.263984 1.204218
totalener: -1637.19976072 hartree
nucrepener: 1981.54264323 hartree
electener: -3618.74240395 hartree
oneelecener: -6184.43341749 hartree
twoeener: 2565.69101353 hartree
kineticenergy: 1632.14872136 hartree
xcener: -121.148743254945 hartree
chargesum: -0.0000000
charge: -0.375908 0.631753 -0.315182 -0.331142 -0.336967 -0.334973 0.492664 -0.039494 0.172755 -0.093661 -0.200812 0.020955 -0.127341 -0.111735 -0.076598 -0.095906 -0.100248 -0.005660 -0.122349 -0.121011 -0.245144 0.131439 0.135016 0.093045 0.100804 0.134124 0.133885 0.143346 0.128920 0.134178 0.156252 0.154334 0.090118 0.094535 0.086012
qa: -0.3759 0.6318 -0.3152 -0.3311 -0.3370 -0.3350 0.4927 -0.0395 0.1728 -0.0937 -0.2008 0.0210 -0.1273 -0.1117 -0.0766 -0.0959 -0.1002 -0.0057 -0.1223 -0.1210 -0.2451 0.1314 0.1350 0.0930 0.1008 0.1341 0.1339 0.1433 0.1289 0.1342 0.1563 0.1543 0.0901 0.0945 0.0860
va: 2.0890 5.2873 2.1260 2.1078 1.9154 1.9178 4.1947 3.6774 3.9387 3.9644 3.9243 3.8726 3.9826 3.9478 3.9764 3.9733 3.9512 3.8836 4.0861 4.0849 3.9104 1.0327 1.0195 1.0144 0.9909 0.9989 0.9975 1.0102 1.0082 0.9969 1.0184 1.0185 1.0099 1.0140 1.0060
dispcorr: -0.018167131 hartree
energy: -1637.217927853421
dipole: 20.93933 -18.57246 2.36687 -0.47106 0.36056 -0.11050 3.88097 -2.95999 0.92098
magnitude: 2.54214 au
magnitude: 6.46161 debye
