program: Orca
programVersion: 5.0.4
elementType: S P O O O O N C C C C C C C C C C C C C C H H H H H H H H H H H H H H
charge: 0
multiplicity: 1
keywords: wb97x-d3
keywords: def2-TZVPP
keywords: def2/J RIJCOSX
keywords: DEFGRID2
keywords: scfconv7
keywords: smallprint printgap noloewdin
keywords: NOSOSCF
formula: C14H14NO4PS
InChI: InChI=1/C14H14NO4PS/c1-2-18-20(21,14-6-4-3-5-7-14)19-13-10-8-12(9-11-13)15(16)17/h3-11H,2H2,1H3
35 atoms
S  0.899487 2.181595 -1.589323
P  1.249726 1.294284 0.072761
O  -0.026753 1.05942 1.067147
O  2.123192 2.075486 1.161626
O  -5.518459 -1.084183 -0.910523
O  -4.728509 -2.858724 -0.011573
N  -4.655332 -1.697524 -0.332291
C  1.988386 -0.343786 -0.05877
C  -1.137297 0.374218 0.672723
C  2.459692 -0.984903 1.087833
C  2.077359 -0.97566 -1.292823
C  3.146291 3.002648 0.785795
C  3.011341 -2.250945 0.991302
C  2.630348 -2.244593 -1.383168
C  -2.145805 1.033281 -0.017498
C  -1.266018 -0.96529 1.014495
C  3.096077 -2.881398 -0.24382
C  -3.429705 -0.98126 0.006175
C  -3.302722 0.352963 -0.348738
C  -2.420829 -1.64885 0.682724
C  4.385558 2.312598 0.261706
H  2.401692 -0.49792 2.053101
H  1.715898 -0.469446 -2.178751
H  2.751334 3.703326 0.046609
H  3.364815 3.560575 1.69571
H  3.379735 -2.746927 1.879463
H  2.697271 -2.733761 -2.345539
H  -2.025374 2.07451 -0.281123
H  -0.469837 -1.46629 1.547972
H  3.528521 -3.870635 -0.315855
H  -4.097125 0.859464 -0.876441
H  -2.532776 -2.688715 0.951408
H  5.167584 3.051957 0.086979
H  4.767277 1.579864 0.972225
H  4.193682 1.807016 -0.685064
totalener: -1637.20015584 hartree
nucrepener: 1972.30672049 hartree
electener: -3609.50687633 hartree
oneelecener: -6165.99200261 hartree
twoeener: 2556.48512628 hartree
kineticenergy: 1632.14405529 hartree
xcener: -121.147794014216 hartree
chargesum: -0.0000000
charge: -0.370169 0.634060 -0.322109 -0.328950 -0.335006 -0.337039 0.492607 -0.075082 0.194866 -0.186608 -0.081964 0.023315 -0.116086 -0.130020 -0.078295 -0.105417 -0.096899 -0.006853 -0.121325 -0.116553 -0.242856 0.134301 0.133005 0.090862 0.100289 0.133739 0.134239 0.135018 0.131858 0.134487 0.155742 0.154893 0.093589 0.085531 0.088834
qa: -0.3702 0.6341 -0.3221 -0.3289 -0.3350 -0.3370 0.4926 -0.0751 0.1949 -0.1866 -0.0820 0.0233 -0.1161 -0.1300 -0.0783 -0.1054 -0.0969 -0.0069 -0.1213 -0.1166 -0.2429 0.1343 0.1330 0.0909 0.1003 0.1337 0.1342 0.1350 0.1319 0.1345 0.1557 0.1549 0.0936 0.0855 0.0888
va: 2.1005 5.2994 2.1264 2.1070 1.9175 1.9155 4.1955 3.6817 3.9229 3.9076 3.9459 3.8739 3.9477 3.9831 3.9896 3.9811 3.9432 3.8814 4.0794 4.0798 3.9112 1.0205 1.0317 1.0152 0.9908 0.9977 0.9991 1.0108 1.0040 0.9968 1.0178 1.0190 1.0140 1.0063 1.0096
dispcorr: -0.017990377 hartree
energy: -1637.218146213611
dipole: 21.78284 -19.24269 2.54016 0.74941 -0.77741 -0.02800 2.54182 -1.78317 0.75865
magnitude: 2.65118 au
magnitude: 6.73875 debye
