program: Orca
programVersion: 5.0.4
elementType: S P O O O O N C C C C C C C C C C C C C C H H H H H H H H H H H H H H
charge: 0
multiplicity: 1
keywords: wb97x-d3
keywords: def2-TZVPP
keywords: def2/J RIJCOSX
keywords: DEFGRID2
keywords: scfconv7
keywords: smallprint printgap noloewdin
keywords: NOSOSCF
formula: C14H14NO4PS
InChI: InChI=1/C14H14NO4PS/c1-2-18-20(21,14-6-4-3-5-7-14)19-13-10-8-12(9-11-13)15(16)17/h3-11H,2H2,1H3
35 atoms
S  1.052593 1.467573 -1.827896
P  1.263612 0.442734 -0.22374
O  0.116158 -0.671189 0.099882
O  1.213238 1.26527 1.159047
O  -6.05409 -1.29576 0.042809
O  -5.930024 0.84125 0.068362
N  -5.435203 -0.259455 0.057516
C  2.719726 -0.601487 -0.110891
C  -1.230045 -0.493572 0.079836
C  3.561959 -0.734444 -1.207658
C  3.016187 -1.257665 1.083018
C  1.756226 2.586172 1.266467
C  4.698738 -1.523201 -1.113302
C  4.151067 -2.045154 1.169752
C  -1.990786 -1.658444 0.056638
C  -1.851774 0.750369 0.095181
C  4.991906 -2.178252 0.072384
C  -3.981461 -0.343463 0.066465
C  -3.368622 -1.587442 0.053379
C  -3.232467 0.821069 0.0858
C  3.268478 2.600619 1.229512
H  3.327411 -0.216012 -2.128613
H  2.368863 -1.153546 1.944056
H  1.346935 3.213364 0.4704
H  1.38632 2.96434 2.218985
H  5.354334 -1.624897 -1.967536
H  4.381519 -2.55604 2.095013
H  -1.492576 -2.618039 0.041309
H  -1.281973 1.667097 0.104111
H  5.878971 -2.79355 0.145074
H  -3.958439 -2.491859 0.03618
H  -3.718685 1.785233 0.093831
H  3.625464 3.613244 1.419079
H  3.694973 1.944755 1.987962
H  3.651631 2.295483 0.255427
totalener: -1637.20075397 hartree
nucrepener: 1941.34632343 hartree
electener: -3578.54707740 hartree
oneelecener: -6104.02507163 hartree
twoeener: 2525.47799423 hartree
kineticenergy: 1632.14222076 hartree
xcener: -121.148963012709 hartree
chargesum: -0.0000000
charge: -0.350841 0.590273 -0.301571 -0.335275 -0.339321 -0.338037 0.492499 0.000218 0.260667 -0.107298 -0.186480 0.021022 -0.128865 -0.122230 -0.145682 -0.081013 -0.100310 -0.024711 -0.094432 -0.133187 -0.238379 0.137360 0.121810 0.090630 0.102241 0.133124 0.131818 0.129599 0.106744 0.133218 0.154177 0.153383 0.095345 0.087291 0.086211
qa: -0.3508 0.5903 -0.3016 -0.3353 -0.3393 -0.3380 0.4925 0.0002 0.2607 -0.1073 -0.1865 0.0210 -0.1289 -0.1222 -0.1457 -0.0810 -0.1003 -0.0247 -0.0944 -0.1332 -0.2384 0.1374 0.1218 0.0906 0.1022 0.1331 0.1318 0.1296 0.1067 0.1332 0.1542 0.1534 0.0953 0.0873 0.0862
va: 2.1217 5.2804 2.2052 2.0561 1.9127 1.9155 4.1934 3.7030 3.8825 3.9311 4.0040 3.8632 3.9805 3.9592 3.9942 3.9260 3.9515 3.9108 4.0615 4.1128 3.9268 1.0293 1.0258 1.0144 0.9892 1.0001 0.9997 1.0118 1.0364 0.9977 1.0172 1.0206 1.0133 1.0064 1.0110
dispcorr: -0.017081839 hartree
energy: -1637.217835808149
dipole: 21.64977 -18.72467 2.92510 3.51833 -3.76850 -0.25017 6.65279 -5.72590 0.92689
magnitude: 3.07862 au
magnitude: 7.82523 debye
