program: Orca
programVersion: 5.0.4
elementType: S S S P O O C C C C C C C C H H H H H H H H H H H H H H H H H H H
charge: 0
multiplicity: 1
keywords: wb97x-d3
keywords: def2-TZVPP
keywords: def2/J RIJCOSX
keywords: DEFGRID2
keywords: scfconv7
keywords: smallprint printgap noloewdin
keywords: NOSOSCF
formula: C8H19O2PS3
InChI: InChI=1/C8H19O2PS3/c1-4-9-11(12,10-5-2)14-8-7-13-6-3/h4-8H2,1-3H3
33 atoms
S  0.19601 -1.392341 -1.106194
S  -2.469712 0.845733 -0.844207
S  0.462315 -0.335835 2.133394
P  1.045315 -0.109139 0.310871
O  2.596773 -0.380086 -0.003182
O  0.910208 1.40557 -0.163223
C  -1.468045 -1.747729 -0.459215
C  -2.565526 -0.936932 -1.118287
C  3.236343 -1.616642 0.373638
C  1.157459 1.834929 -1.51714
C  -2.978621 0.972878 0.895135
C  4.048442 -1.44402 1.631933
C  0.634565 3.239152 -1.669366
C  -4.45426 0.718515 1.126516
H  -1.454598 -1.628008 0.624849
H  -1.630013 -2.808031 -0.659301
H  -3.5302 -1.316717 -0.774779
H  -2.545513 -1.077132 -2.199558
H  2.495696 -2.408847 0.496291
H  3.87044 -1.891395 -0.467059
H  2.229607 1.793294 -1.716684
H  0.653035 1.162102 -2.213155
H  -2.357516 0.310724 1.499896
H  -2.715938 1.990557 1.188314
H  4.790097 -0.653837 1.523796
H  3.415667 -1.215354 2.4876
H  4.578921 -2.372699 1.842834
H  0.828458 3.581485 -2.685531
H  -0.440142 3.281702 -1.499034
H  1.127308 3.929434 -0.985711
H  -5.070214 1.424458 0.571093
H  -4.745309 -0.289851 0.831115
H  -4.691198 0.825749 2.18635
elementType: S P O C H
totalener: -2002.87191464 hartree
nucrepener: 1578.10726770 hartree
electener: -3580.97918234 hartree
oneelecener: -5900.30424733 hartree
twoeener: 2319.32506499 hartree
cpcmener: -0.02032351 hartree
kineticenergy: 1997.87873693 hartree
xcener: -120.689796319103 hartree
chargesum: -0.0000000
charge: -0.182095 -0.172749 -0.452361 0.657272 -0.368955 -0.334737 -0.097580 -0.130850 0.047847 -0.002470 -0.088805 -0.242571 -0.235556 -0.258232 0.115538 0.132987 0.114915 0.113638 0.081661 0.110231 0.121876 0.102940 0.082003 0.108040 0.089490 0.074325 0.094075 0.089575 0.080513 0.091352 0.080267 0.085363 0.093049
qa: -0.1821 -0.1727 -0.4524 0.6573 -0.3690 -0.3347 -0.0976 -0.1309 0.0478 -0.0025 -0.0888 -0.2426 -0.2356 -0.2582 0.1155 0.1330 0.1149 0.1136 0.0817 0.1102 0.1219 0.1029 0.0820 0.1080 0.0895 0.0743 0.0941 0.0896 0.0805 0.0914 0.0803 0.0854 0.0930
va: 2.2865 2.1775 2.0064 5.4260 2.0732 2.0941 3.8385 3.9808 3.8453 3.8452 3.9193 3.9391 3.9397 3.9471 1.0315 1.0075 1.0070 1.0100 1.0131 0.9930 0.9987 1.0031 1.0278 1.0032 1.0038 1.0210 1.0077 1.0063 1.0127 1.0033 1.0120 1.0018 1.0045
dispcorr: -0.016013483 hartree
energy: -2002.887928127340
dipole: -5.48353 5.30523 -0.17830 2.63451 -3.72671 -1.09220 -0.48555 -0.72694 -1.21249
magnitude: 1.64159 au
magnitude: 4.17260 debye
